{"text_format":"1","workbook":"xlsx","n_sheets":36,"sheets":["Menu","HFPM_Start","Results","Print Excel","Instructions","Your Assessment","Completeness","Etape_1_Resume","Completeness-Obj","Check","Assessment-check","Your Assessment-Obj","Print_option","Dataset","Policy Development Process","Revenue Raising","Pooling Revenues","Purchasing and Provider Payment","Benefits and Entitlements","PFM","Governance","Efficiency","Equity_Reso","Transp_accoun","Equity_Fin","Financial_prot","Quality","Sheet1","Print your results Full","Print your results","Print-Full","Print-Full2","Exc2","Exc3","Utilization","Objectives"],"not_rendered":{"charts":29,"images":161,"macros":1,"external_links":1,"defined_names":659,"comments":16,"pivot_tables":0},"unopened":[],"bounds":{"document_bytes":16777216,"sheet_cells":100000,"rows_first":2000,"rows_last":500,"rows_between":2000,"halvings":0,"cell_chars":16384,"cell_head_chars":4096},"cells_cut":0,"cells_raw":0,"read":"whole","date_system":"1900"}

{"sheet":"Menu","index":0,"n_rows":23,"n_cols":19,"rows_kept":23,"cut":false,"hidden":false,"merged":[[4,2,4,20],[6,6,7,7],[6,15,7,16],[18,2,20,20],[6,3,7,4],[6,12,7,13],[6,9,7,10],[6,18,7,19]]}
[" "]
[]
[null,null,"MATRICE DE PROGRÈS POUR LE FINANCEMENT DE LA SANTÉ"]
[null,null,"Version V2.2"]
[null,null,"MENU"]
[]
[null,null,null,"Instructions",null,null,"Commencez à utiliser les matrice",null,null,"Vérifiez l’exhaustivité ",null,null,"Résumé de votre évaluation",null,null,"Objectifs du système de santé",null,null,"Imprimez votre évaluation"]
[]
[]
[]
[]
[]
[]
[]
[]
[null,null,null," "]
[]
[null,null,"Remerciements"]
[null,null,"Nous tenons à remercier tous ceux qui ont contribué à l’élaboration des matrices de progrès dans le cadre d’une réunion d’examen qui s’est tenue à Genève en mai 2018. Ce travail a bénéficié du soutien financier de la République de Corée du Sud et du Royaume-Uni (don du DfID MCHSS), que nous tenons également à remercier vivement."]
[]
[]
[]
[null,null,null,null,null,null,null,null,null,null,null,null,null,"© Organisation Mondiale de la Santé 2019. Tous les droits sont réservés."]

{"sheet":"HFPM_Start","index":1,"n_rows":2,"n_cols":3,"rows_kept":2,"cut":false,"hidden":true,"merged":[[2,2,2,19]]}
[]
[null,null,"MATRICE DE PROGRÈS POUR LE FINANCEMENT DE LA SANTÉ"]

{"sheet":"Results","index":2,"n_rows":201,"n_cols":58,"rows_kept":201,"cut":false,"hidden":true,"merged":[[51,1,56,1],[33,1,39,1],[7,1,10,1],[11,1,15,1],[40,1,50,1],[5,28,5,29],[5,31,5,32],[5,24,5,26],[16,1,22,1],[23,1,32,1]]}
[]
[{"$f":"Instructions!G19","v":"Nom du pays :"},{"$f":"Country","v":0},null,null,{"$f":"Q1.1+1","v":1}]
["Code",{"$f":"IFERROR(VLOOKUP(B2,Y8:Z201,2,0),\"\")","v":""},null,null,null,null,null,null,null,null,null,null,null,null,null,null,null,null,null,null,null,"Non pertinent"]
[{"$f":"Instructions!H26","v":"De : "},{"$f":"Instructions!I26","v":0},{"$f":"Instructions!K26","v":0},{"$f":"A4&B4&\" -\"&C4","v":"De : 0 -0"},null,"WHO region",{"$f":"VLOOKUP(code,$BC$7:$BF$200,3,0)","v":{"$error":"#N/A"}}]
[{"$f":"Instructions!H27","v":"À : "},{"$f":"Instructions!I27","v":0},{"$f":"Instructions!K27","v":0},{"$f":"A5&B5&\" -\"&C5","v":"À : 0 -0"},{"$f":"C5&\" -\"&B5","v":"0 -0"},"income",{"$f":"VLOOKUP(code,$BC$7:$BF$200,4,0)","v":{"$error":"#N/A"}},null,null,null,null,null,null,null,null,null,null,null,null,null,null,null,null,null,null,null,null,null,null,null,null,null,null,null,null,null,null,null,null,null,null,null,null,null,null,null,null,null,null,null,null,null,null,null,"CLASSIFICATION"]
[{"$f":"Instructions!G21","v":"Rempli par :"},{"$f":"Instructions!H21","v":0},{"$f":"Instructions!G23","v":"Processus suivi:"},{"$f":"Instructions!H23","v":0},null,null,null,null,null,null,null,null,null,null,null,null,null,null,null,null,null,null,null,null,"Countries",null,null,null,"FROM",null,null,"TO",null,null,null,null,null,"Efficience","Équité dans la distribution des ressources","Transparence et responsabilité","Équité des financements","Protection financière ","Qualité","Utilisation par rapport aux besoins",null,null,null,"FUNCTION","Question_description","Result_text","score_number","Question_required",null,null,"code","country","WHO region","income"]
[null,"Module",null,"Question","Result","Text","Question does not apply",null,"Type of text",null,"Module number",null,"Actions",null,"Selection",null,"Number","Title","Value","Action",null,"Completeness",null,null,"Country","WHO code",null,null,"YEAR","MONTH",null,"YEAR","MONTH",null,null,null,1,2.4,3.2,2.1,2.1,2.1,4.2,2.2999999999999998,null,null,"Equity_in_resource_distribution","Q3.2",{"$f":"VLOOKUP(AV7,$C$8:$G$57,2,0)","v":"Dans le cadre du processus global d’élaboration et de planification de la mise en œuvre des politiques de financement de la santé, quelle est l’approche de votre pays en matière de dispositifs de mise en commun des ressources ?"},{"$f":"VLOOKUP(AV7,$C$8:$G$57,4,0)","v":""},{"$f":"VLOOKUP(AV7,$C$8:$G$57,3,0)","v":0},{"$f":"VLOOKUP(AV7,$C$8:$G$57,5,0)","v":false},null,null,"AFG","Afghanistan","EMR","Low"]
[1.1000000000000001,"Processus d’élaboration des politiques","Q1.1","Le système de financement de la santé de votre pays a-t-il récemment fait l’objet d’un diagnostic ou d’une évaluation approfondie qui examine son impact sur les performances du système de santé ainsi que les causes des problèmes de performance ?",0,{"$f":"IF(OR(T1.1=$I$9,T1.1=\"\"),\"\",T1.1)","v":""},false,{"$f":"E8&\"/12\"","v":"0/12"},"Veuillez décrire dans cette zone de texte les principales caractéristiques des droits à prestation dans votre pays, ainsi que les évolutions récentes, les plans futurs, etc.",null,"Processus d’élaboration des politiques",1,{"$f":"IF(TA.1=\"\",\"\",TA.1)","v":""},null,"Selected",{"$f":"VLOOKUP(Selected,$K$8:$L$14,2,0)","v":1},{"$f":"IF(OR(P8+0.1= 3.1,P8+0.1= 5.1),\"\",P8+0.1)","v":1.1000000000000001},{"$f":"IFERROR(CONCATENATE(U8,\". \",VLOOKUP(Q8,$A$8:$E$57,4,0)),\"\")","v":"1.1. Le système de financement de la santé de votre pays a-t-il récemment fait l’objet d’un diagnostic ou d’une évaluation approfondie qui examine son impact sur les performances du système de santé ainsi que les causes des problèmes de performance ?"},{"$f":"IFERROR(VLOOKUP(Q8,$A$8:$E$57,5,0),\"\")","v":0},{"$f":"IFERROR(VLOOKUP(P8,$L$8:$M$14,2,0),\"\")","v":""},{"$f":"IF(Q8=4.11,\"4,10\",IF(Q8=6.16,\"6,11\",IF(Q8=6.15,\"6,10\",Q8)))","v":1.1000000000000001},"Non terminé",null,null,"Afghanistan","AFG",null,null,2018,"January",null,2018,"January",null,null,null,2,3.2,3.3,2.2999999999999998,2.2000000000000002,2.2000000000000002,4.3,2.4,null,null,"Equity_in_resource_distribution","Q3.3",{"$f":"VLOOKUP(AV8,$C$8:$G$57,2,0)","v":"Dans quelle mesure la capacité de redistribution des fonds prépayés dans votre pays est-elle limitée par le cadre institutionnel du financement de la santé ?"},{"$f":"VLOOKUP(AV8,$C$8:$G$57,4,0)","v":""},{"$f":"VLOOKUP(AV8,$C$8:$G$57,3,0)","v":0},{"$f":"VLOOKUP(AV8,$C$8:$G$57,5,0)","v":false},null,null,"ALB","Albania","EUR","Up-Mid"]
[1.2,null,"Q1.2","A-t-on transposé en textes de loi/décrets une déclaration de politique récente relative au financement de la santé ?",0,{"$f":"IF(OR(T1.2=$I$9,T1.2=\"\"),\"\",T1.2)","v":""},false,{"$f":"E9&\"/12\"","v":"0/12"},"Veuillez indiquer dans cette zone de texte vos idées, réflexions, évolutions récentes, projets actuels, etc.",null,"Collecte de recettes",2,{"$f":"IF(TA.2=\"\",\"\",TA.2)","v":""},null,"title",{"$f":"P8&\". \"&Selected","v":"1. Processus d’élaboration des politiques"},{"$f":"P8+0.2","v":1.2},{"$f":"IFERROR(CONCATENATE(U9,\". \",VLOOKUP(Q9,$A$8:$E$57,4,0)),\"\")","v":"1.2. A-t-on transposé en textes de loi/décrets une déclaration de politique récente relative au financement de la santé ?"},0,null,{"$f":"IF(Q9=4.11,\"4,10\",IF(Q9=6.16,\"6,11\",IF(Q9=6.15,\"6,10\",Q9)))","v":1.2},"Terminé",null,null,"Albania","ALB",null,null,2019,"February",null,2019,"February",null,null,null,3,3.3,3.4,4.4000000000000004,2.4,2.4,4.4000000000000004,2.5,null,null,"Equity_in_resource_distribution","Q3.4","Y-a-il des mesures, dans la conception des prestations, le paiement des prestataires ou les systèmes sous-jacents non financiers, qui visent à contrecarrer les problèmes découlant de la fragmentation de l’architecture du financement de la santé ?","",0,false,null,null,"DZA","Algeria","AFR","Up-Mid"]
[1.3,null,"Q1.3","Existe-t-il un système de suivi régulier du financement de la santé, et si oui les données sont-elles utilisées pour suivre les progrès effectués (par exemple sur les modèles de dépenses et la protection financière) et pour renforcer la reddition de comptes ?",0,{"$f":"IF(OR(T1.3=$I$9,T1.3=\"\"),\"\",T1.3)","v":""},false,"0/12",null,null,"Mise en commun des recettes",3,{"$f":"IF(TA.3=\"\",\"\",TA.3)","v":""},null,null,null,{"$f":"P8+0.3","v":1.3},"1.3. Existe-t-il un système de suivi régulier du financement de la santé, et si oui les données sont-elles utilisées pour suivre les progrès effectués (par exemple sur les modèles de dépenses et la protection financière) et pour renforcer la reddition de comptes ?",0,null,1.3,"Non pertinent",null,null,"Algeria","DZA",null,null,2020,"March",null,2020,"March",null,null,null,4,3.4,3.5,4.8,2.5,2.5,4.5999999999999996,3.2,null,null,"Equity_in_resource_distribution","Q3.5","Dans quelle mesure les différentes sources de revenus et de financement sont-elles organisées de manière complémentaire, afin de financer un paquet de prestations pour l’ensemble de la population ?","",0,false,null,null,"AND","Andorra","EUR","Hi"]
[1.4,null,"Q1.4","Les études d’évaluation sont-elles réalisées sur une base systématique pour mesurer les conséquences de la mise en œuvre de réformes spécifiques du financement sur les objectifs du système de santé et dans quelles mesure les résultats servent-ils à guider la conception et la révision des politiques de financement de la santé ?",0,{"$f":"IF(OR(T1.4=$I$9,T1.4=\"\"),\"\",T1.4)","v":""},false,"0/12",null,null,"Achats et paiement des prestataires",4,{"$f":"IF(TA.4=\"\",\"\",TA.4)","v":""},null,null,null,{"$f":"P8+0.4","v":1.4},"1.4. Les études d’évaluation sont-elles réalisées sur une base systématique pour mesurer les conséquences de la mise en œuvre de réformes spécifiques du financement sur les objectifs du système de santé et dans quelles mesure les résultats servent-ils à guider la conception et la révision des politiques de financement de la santé ?",0,null,1.4,null,null,null,"Andorra","AND",null,null,2021,"April",null,2021,"April",null,null,null,5,3.5,3.6,5.2,3.4,3.2,4.7,3.3,null,null,"Equity_in_resource_distribution","Q3.6","Dans quelle mesure les dispositifs d’assurance-maladie volontaire sont-ils une source d’inégalités, créant des effets de contagion potentiellement néfastes pour l’ensemble du système de santé ?","",0,false,null,null,"AGO","Angola","AFR","Up-Mid"]
[2.1,"Collecte de recettes\n","Q2.1","Quelle approche est en vigueur dans votre pays en matière d’élaboration de politiques et de stratégies de collecte de revenus ? Cette approche s'inscrit-elle dans le cadre du processus global d’élaboration et de planification de la mise en œuvre des politiques de financement de la santé ?",0,{"$f":"IF(OR(T2.1=$I$9,T2.1=\"\"),\"\",T2.1)","v":""},false,"0/12",null,null,"Prestations et droits",5,{"$f":"IF(TA.5=\"\",\"\",TA.5)","v":""},null,null,null,{"$f":"P8+0.5","v":1.5},"","",null,1.5,null,null,null,"Angola","AGO",null,null,null,"May",null,null,"May",null,null,null,6,3.7,4.0999999999999996,5.5,3.6,3.3,4.8,3.4,null,null,"Equity_in_resource_distribution","Q4.1","Dans quelle mesure les allocations de fonds aux acheteurs de niveau inférieur, par exemple les administrations locales, et/ou les taux de paiement aux prestataires sont-ils le reflet des besoins de santé de la population ?","",0,false,null,null,"ATG","Antigua and Barbuda","AMR","Hi"]
[2.2000000000000002,null,"Q2.2","Dans quelle mesure le financement de la santé dans votre pays repose-t-il sur des sources de financement public/obligatoire (par exemple, fiscalité/recettes publiques, y compris les cotisations obligatoires à l’assurance-maladie nationale/sociale) ?",0,{"$f":"IF(OR(T2.2=$I$9,T2.2=\"\"),\"\",T2.2)","v":""},false,"0/12",null,null,"Gestion des finances publiques (GFP)",6,{"$f":"IF(TA.6=\"\",\"\",TA.6)","v":""},null,null,null,{"$f":"P8+0.6","v":1.6},"","",null,1.6,null,null,null,"Antigua and Barbuda","ATG",null,null,null,"June",null,null,"June",null,null,null,7,4.5,4.2,5.7,4.1100000000000003,3.4,4.9000000000000004,3.5,null,null,"Equity_in_resource_distribution","Q4.2","Dans quelle mesure les paiements des prestataires sont-ils harmonisés entre régimes/sources de revenus et entre secteurs public et privé, afin de garantir des incitations cohérentes aux prestataires ?","",0,false,null,null,"ARG","Argentina","AMR","Up-Mid"]
[2.2999999999999998,null,"Q2.3","Dans quelle mesure le financement public de la santé dans votre pays est-il prédictible sur plusieurs années ?",0,{"$f":"IF(OR(T2.3=$I$9,T2.3=\"\"),\"\",T2.3)","v":""},false,"0/12",null,null,"Gouvernance",7,{"$f":"IF(TA.7=\"\",\"\",TA.7)","v":""},null,null,null,{"$f":"P8+0.7","v":1.7},"","",null,1.7,null,null,null,"Argentina","ARG",null,null,null,"July",null,null,"July",null,null,null,8,4.8,6.4,6.5,5.4,3.5,7.2,4.0999999999999996,null,null,"Equity_in_resource_distribution","Q6.4","Dans quelle mesure les allocations budgétaires annuelles en matière de santé sont alignées sur les priorités du secteur de la santé (niveau, structure, nature/objectif) ?","",0,false,null,null,"ARM","Armenia","EUR","Low-Mid"]
[2.4,null,"Q2.4","Dans quelle mesure le flux de fonds publics est-il stable, notamment grâce à une exécution budgétaire régulière, c’est-à-dire un déblocage des fonds dans les délais, conformément aux budgets de santé approuvés ?",0,{"$f":"IF(OR(T2.4=$I$9,T2.4=\"\"),\"\",T2.4)","v":""},false,"0/12",null,null,null,null,null,null,null,null,{"$f":"P8+0.8","v":1.8},"","",null,1.8,null,null,null,"Armenia","ARM",null,null,null,"August",null,null,"August",null,null,null,9,4.9000000000000004,6.6,6.7,5.6,3.6,null,5.3,null,null,"Equity_in_resource_distribution","Q6.6","Dans quelle mesure les transferts fiscaux sont conçus et mis en œuvre de sorte à améliorer l’équité de la distribution des ressources dans le secteur de la santé?","",0,false,null,null,"AUS","Australia","WPR","Hi"]
[2.5,null,"Q2.5","Dans quelle mesure les différentes sources de revenus sont-elles collectées de façon progressive (c.-à-d. en fonction de la capacité de payer), et partant de là favorisent l’équité dans le mode de financement du système de santé ?",0,{"$f":"IF(OR(T2.5=$I$9,T2.5=\"\"),\"\",T2.5)","v":""},false,"0/12",null,null,null,null,null,null,null,null,{"$f":"P8+0.9","v":1.9},"","",null,1.9,null,null,null,"Australia","AUS",null,null,null,"September",null,null,"September",null,null,null,10,4.1100000000000003,6.16,6.9,null,4.1100000000000003,null,5.4,null,null,"Equity_in_resource_distribution","Q6.11","Dans quelle mesure les flux financiers multiples, la structure budgétaire et les règles de GFP sont alignés sur les politiques d’achats stratégiques?","",0,false,null,null,"AUT","Austria","EUR","Hi"]
[3.1,"Mise en commun des recettes","Q3.1","Cette question a été maintenant remplacé par l’étape 1 et le tableau de vue d’ensemble et ne constitue donc plus une question distincte. Merci de bien vous assurer que vous avez complété l’étape 1 car cela vous aidera à remplir les questions de cette section.",0,{"$f":"IF(OR(T3.1=$I$9,T3.1=\"\"),\"\",T3.1)","v":""},false,"0/12",null,null,"Method",null,"Actions",null,null,null,{"$f":"IF(P8=4,4.11,IF(P8=6,6.15,\"\"))","v":""},"","",null,"",null,null,null,"Austria","AUT",null,null,null,"October",null,null,"October",null,null,null,11,6.7,null,7.1,null,5.4,null,5.5,null,null,"Efficiency","Q2.4","Dans quelle mesure le flux de fonds publics est-il stable, notamment grâce à une exécution budgétaire régulière, c’est-à-dire un déblocage des fonds dans les délais, conformément aux budgets de santé approuvés ?","",0,false,null,null,"AZE","Azerbaijan","EUR","Up-Mid"]
[3.2,null,"Q3.2","Dans le cadre du processus global d’élaboration et de planification de la mise en œuvre des politiques de financement de la santé, quelle est l’approche de votre pays en matière de dispositifs de mise en commun des ressources ?",0,{"$f":"IF(OR(T3.2=$I$9,T3.2=\"\"),\"\",T3.2)","v":""},false,"0/12",null,null,"Efficience",1,{"$f":"IF(TA.1=\"\",\"\",TA.1)","v":""},null,null,null,{"$f":"IF(P8=6,6.16,\"\")","v":""},"",{"$f":"IFERROR(VLOOKUP(Q18,$A$8:$E$57,5,0),\"\")","v":""},null,"",null,null,null,"Azerbaijan","AZE",null,null,null,"November",null,null,"November",null,null,null,12,6.8,null,7.2,null,5.6,null,5.6,null,null,"Efficiency","Q3.2","Dans le cadre du processus global d’élaboration et de planification de la mise en œuvre des politiques de financement de la santé, quelle est l’approche de votre pays en matière de dispositifs de mise en commun des ressources ?","",0,false,null,null,"BHS","Bahamas","AMR","Hi"]
[3.3,null,"Q3.3","Dans quelle mesure la capacité de redistribution des fonds prépayés dans votre pays est-elle limitée par le cadre institutionnel du financement de la santé ?",0,{"$f":"IF(OR(T3.3=$I$9,T3.3=\"\"),\"\",T3.3)","v":""},false,"0/12",null,null,"Équité dans la distribution des ressources",2,{"$f":"IF(TA.2=\"\",\"\",TA.2)","v":""},null,"Selection",null,"Number",null,"Title","Value","Action",null,null,null,"Bahamas","BHS",null,null,null,"December",null,null,"December",null,null,null,13,6.9,null,7.3,null,null,null,5.7,null,null,"Efficiency","Q3.3","Dans quelle mesure la capacité de redistribution des fonds prépayés dans votre pays est-elle limitée par le cadre institutionnel du financement de la santé ?","",0,false,null,null,"BHR","Bahrain","EMR","Hi"]
[3.4,null,"Q3.4","Y-a-il des mesures, dans la conception des prestations, le paiement des prestataires ou les systèmes sous-jacents non financiers, qui visent à contrecarrer les problèmes découlant de la fragmentation de l’architecture du financement de la santé ?",0,{"$f":"IF(OR(T3.4=$I$9,T3.4=\"\"),\"\",T3.4)","v":""},false,"0/12",null,null,"Transparence et responsabilité",3,{"$f":"IF(TA.3=\"\",\"\",TA.3)","v":""},null,"Selected",{"$f":"VLOOKUP(Selected2,K18:L24,2,0)","v":2},1,{"$f":"IFERROR(VLOOKUP(Q20,$AK$6:$AR$23,$P$20+1,0),\"\")","v":3.2},{"$f":"IFERROR(CONCATENATE(U20,\". \",VLOOKUP(R20,$A$8:$E$57,4,0)),\"\")","v":"3.2. Dans le cadre du processus global d’élaboration et de planification de la mise en œuvre des politiques de financement de la santé, quelle est l’approche de votre pays en matière de dispositifs de mise en commun des ressources ?"},{"$f":"IFERROR(VLOOKUP(R20,$A$8:$E$57,5,0),\"\")","v":0},{"$f":"IF(R20=4.11,\"4,10\",IF(R20=6.16,\"6,11\",IF(R20=6.15,\"6,10\",R20)))","v":3.2},null,null,null,"Bahrain","BHR",null,null,null,null,null,null,null,null,null,null,14,6.16,null,7.4,null,null,null,6.4,null,null,"Efficiency","Q3.4","Y-a-il des mesures, dans la conception des prestations, le paiement des prestataires ou les systèmes sous-jacents non financiers, qui visent à contrecarrer les problèmes découlant de la fragmentation de l’architecture du financement de la santé ?","",0,false,null,null,"BGD","Bangladesh","SEAR","Low"]
[3.5,null,"Q3.5","Dans quelle mesure les différentes sources de revenus et de financement sont-elles organisées de manière complémentaire, afin de financer un paquet de prestations pour l’ensemble de la population ?",0,{"$f":"IF(OR(T3.5=$I$9,T3.5=\"\"),\"\",T3.5)","v":""},false,"0/12",null,null,"Équité des financements",4,{"$f":"IF(TA.4=\"\",\"\",TA.4)","v":""},null,"title",{"$f":"Selected2","v":"Équité dans la distribution des ressources"},2,{"$f":"IFERROR(VLOOKUP(Q21,$AK$6:$AR$23,$P$20+1,0),\"\")","v":3.3},{"$f":"IFERROR(CONCATENATE(U21,\". \",VLOOKUP(R21,$A$8:$E$57,4,0)),\"\")","v":"3.3. Dans quelle mesure la capacité de redistribution des fonds prépayés dans votre pays est-elle limitée par le cadre institutionnel du financement de la santé ?"},{"$f":"IFERROR(VLOOKUP(R21,$A$8:$E$57,5,0),\"\")","v":0},{"$f":"IF(R21=4.11,\"4,10\",IF(R21=6.16,\"6,11\",IF(R21=6.15,\"6,10\",R21)))","v":3.3},null,null,null,"Bangladesh","BGD",null,null,null,null,null,null,null,null,null,null,15,null,null,7.5,null,null,null,6.6,null,null,"Efficiency","Q3.5","Dans quelle mesure les différentes sources de revenus et de financement sont-elles organisées de manière complémentaire, afin de financer un paquet de prestations pour l’ensemble de la population ?","",0,false,null,null,"BRB","Barbados","AMR","Hi"]
[3.6,null,"Q3.6","Dans quelle mesure les dispositifs d’assurance-maladie volontaire sont-ils une source d’inégalités, créant des effets de contagion potentiellement néfastes pour l’ensemble du système de santé ?",0,{"$f":"IF(OR(T3.6=$I$9,T3.6=\"\"),\"\",T3.6)","v":""},false,"0/12",null,null,"Protection financière ",5,{"$f":"IF(TA.5=\"\",\"\",TA.5)","v":""},null,null,null,3,3.4,"3.4. Y-a-il des mesures, dans la conception des prestations, le paiement des prestataires ou les systèmes sous-jacents non financiers, qui visent à contrecarrer les problèmes découlant de la fragmentation de l’architecture du financement de la santé ?",0,3.4,null,null,null,"Barbados","BRB",null,null,null,null,null,null,null,null,null,null,16,null,null,7.6,null,null,null,6.7,null,null,"Efficiency","Q3.7","Dans quelle mesure les flux financiers sont-ils incohérents et redondants, et empêchent d’utiliser efficacement le budget public et les fonds des donateurs ?","",0,false,null,null,"BLR","Belarus","EUR","Up-Mid"]
[3.7,null,"Q3.7","Dans quelle mesure les flux financiers sont-ils incohérents et redondants, et empêchent d’utiliser efficacement le budget public et les fonds des donateurs ?",0,{"$f":"IF(OR(T3.7=$I$9,T3.7=\"\"),\"\",T3.7)","v":""},false,"0/12",null,null,"Qualité",6,{"$f":"IF(TA.6=\"\",\"\",TA.6)","v":""},null,null,"Utilization relative to need",4,3.5,"3.5. Dans quelle mesure les différentes sources de revenus et de financement sont-elles organisées de manière complémentaire, afin de financer un paquet de prestations pour l’ensemble de la population ?",0,3.5,null,null,null,"Belarus","BLR",null,null,null,null,null,null,null,null,null,null,17,null,null,null,null,null,null,6.15,null,null,"Efficiency","Q4.5","Dans quelle mesure les méthodes de paiement des prestataires favorisent-elles l’efficacité de l’allocation des ressources, par exemple en réduisant la prestation excessive ou en augmentant celle insuffisante des services, et gèrent-elles la croissance des dépenses ?","",0,false,null,null,"BEL","Belgium","EUR","Hi"]
[4.0999999999999996,"Achats et paiement des prestataires","Q4.1","Dans quelle mesure les allocations de fonds aux acheteurs de niveau inférieur, par exemple les administrations locales, et/ou les taux de paiement aux prestataires sont-ils le reflet des besoins de santé de la population ?",0,{"$f":"IF(OR(T4.1=$I$9,T4.1=\"\"),\"\",T4.1)","v":""},false,"0/12",null,null,"Utilisation par rapport aux besoins",7,{"$f":"IF(TA.7=\"\",\"\",TA.7)","v":""},null,null,null,5,3.6,"3.6. Dans quelle mesure les dispositifs d’assurance-maladie volontaire sont-ils une source d’inégalités, créant des effets de contagion potentiellement néfastes pour l’ensemble du système de santé ?",0,3.6,null,null,null,"Belgium","BEL",null,null,null,null,null,null,null,null,null,null,null,null,null,null,null,null,null,null,null,null,"Efficiency","Q4.8","Dans quelle mesure les prestataires jouissent-ils d’une autonomie financière et sont-ils tenus responsables, dans une mesure réaliste et conforme à leurs capacités ?","",0,false,null,null,"BLZ","Belize","AMR","Up-Mid"]
[4.2,null,"Q4.2","Dans quelle mesure les paiements des prestataires sont-ils harmonisés entre régimes/sources de revenus et entre secteurs public et privé, afin de garantir des incitations cohérentes aux prestataires ?",0,{"$f":"IF(OR(T4.2=$I$9,T4.2=\"\"),\"\",T4.2)","v":""},false,"0/12",null,null,null,null,null,null,null,null,6,4.0999999999999996,"4.1. Dans quelle mesure les allocations de fonds aux acheteurs de niveau inférieur, par exemple les administrations locales, et/ou les taux de paiement aux prestataires sont-ils le reflet des besoins de santé de la population ?",0,4.0999999999999996,null,null,null,"Belize","BLZ",null,null,null,null,null,null,null,null,null,null,null,null,null,null,null,null,null,null,null,null,"Efficiency","Q4.9","Dans quelle mesure l’accréditation des prestataires ou les contrats sélectifs sont-ils établis, fonctionnels et utilisés pour les achats ?","",0,false,null,null,"BEN","Benin","AFR","Low"]
[4.3,null,"Q4.3","Dans quelle mesure les méthodes de paiement des prestataires et les achats en général favorisent-ils la qualité des soins et la coordination des soins entre les spécialités et les différents niveaux de soins ?",0,{"$f":"IF(OR(T4.3=$I$9,T4.3=\"\"),\"\",T4.3)","v":""},false,"0/12",null,null,null,null,null,null,null,null,7,4.2,"4.2. Dans quelle mesure les paiements des prestataires sont-ils harmonisés entre régimes/sources de revenus et entre secteurs public et privé, afin de garantir des incitations cohérentes aux prestataires ?",0,4.2,null,null,null,"Benin","BEN",null,null,null,null,null,null,null,null,null,null,null,null,null,null,null,null,null,null,null,null,"Efficiency","Q4.10","Dans quelle mesure l’achat et le paiement des produits pharmaceutiques sont-ils mis en œuvre pour promouvoir l’utilisation efficace des médicaments (par exemple le recours aux génériques plutôt qu’aux princeps) et pour améliorer la protection financière des patients ?","",0,false,null,null,"BTN","Bhutan","SEAR","Low-Mid"]
[4.4000000000000004,null,"Q4.4","Dans quelle mesure les contrats d’achat précisent-ils des exigences en matière de qualité des soins, y compris la disponibilité et la pertinence des soins, puis vérifient-ils de façon régulière qu’elles sont bien respectées ?",0,{"$f":"IF(OR(T4.4=$I$9,T4.4=\"\"),\"\",T4.4)","v":""},false,"0/12",null,null,null,null,null,null,null,null,8,6.4,"6.4. Dans quelle mesure les allocations budgétaires annuelles en matière de santé sont alignées sur les priorités du secteur de la santé (niveau, structure, nature/objectif) ?",0,6.4,null,null,null,"Bhutan","BTN",null,null,null,null,null,null,null,null,null,null,null,null,null,null,null,null,null,null,null,null,"Efficiency","Q6.7","Dans quelle mesure les règles du budget de la santé permettent-elles une certaine souplesse des dépenses? ","",0,false,null,null,"BOL","Bolivia Plurinational States of","AMR","Low-Mid"]
[4.5,null,"Q4.5","Dans quelle mesure les méthodes de paiement des prestataires favorisent-elles l’efficacité de l’allocation des ressources, par exemple en réduisant la prestation excessive ou en augmentant celle insuffisante des services, et gèrent-elles la croissance des dépenses ?",0,{"$f":"IF(OR(T4.5=$I$9,T4.5=\"\"),\"\",T4.5)","v":""},false,"0/12",null,null,null,null,null,null,null,null,9,6.6,"6.6. Dans quelle mesure les transferts fiscaux sont conçus et mis en œuvre de sorte à améliorer l’équité de la distribution des ressources dans le secteur de la santé?",0,6.6,null,null,null,"Bolivia Plurinational States of","BOL",null,null,null,null,null,null,null,null,null,null,null,null,null,null,null,null,null,null,null,null,"Efficiency","Q6.8","La flexibilité dans l’utilisation des ressources est-elle assurée ou déléguée au bon niveau?","",0,false,null,null,"BIH","Bosnia and Herzegovina","EUR","Up-Mid"]
[4.5999999999999996,null,"Q4.6","Dans quelle mesure les formulaires de consultation des patients sont-ils normalisés dans l'ensemble du système de santé et utilisés pour analyser et évaluer l'activité de l’ensemble des prestataires et de la population ",0,{"$f":"IF(OR(T4.6=$I$9,T4.6=\"\"),\"\",T4.6)","v":""},false,"0/12",null,null,null,null,null,null,null,null,10,6.16,"6,11. Dans quelle mesure les flux financiers multiples, la structure budgétaire et les règles de GFP sont alignés sur les politiques d’achats stratégiques?",0,"6,11",{"$f":"R29=U29","v":false},null,null,"Bosnia and Herzegovina","BIH",null,null,null,null,null,null,null,null,null,null,null,null,null,null,null,null,null,null,null,null,"Efficiency","Q6.9","Dans quelle mesure des politiques de discipline budgétaire visant à contrôler les dépenses sont en vigueur (par exemple, gestion de la trésorerie, respect des règles d’approvisionnement) et mises en œuvre efficacement?","",0,false,null,null,"BWA","Botswana","AFR","Up-Mid"]
[4.7,null,"Q4.7","Dans quelle mesure les paiements des prestataires  couvrent  uniquement une partie ou l’ensemble des coûts totaux (y compris les salaires, les dépenses récurrentes, etc.) ?",0,{"$f":"IF(OR(T4.7=$I$9,T4.7=\"\"),\"\",T4.7)","v":""},false,"0/12",null,null,null,null,null,null,null,null,11,0,"","",0,null,null,null,"Botswana","BWA",null,null,null,null,null,null,null,null,null,null,null,null,null,null,null,null,null,null,null,null,"Efficiency","Q6.11","Dans quelle mesure les flux financiers multiples, la structure budgétaire et les règles de GFP sont alignés sur les politiques d’achats stratégiques?","",0,false,null,null,"BRA","Brazil","AMR","Up-Mid"]
[4.8,null,"Q4.8","Dans quelle mesure les prestataires jouissent-ils d’une autonomie financière et sont-ils tenus responsables, dans une mesure réaliste et conforme à leurs capacités ?",0,{"$f":"IF(OR(T4.8=$I$9,T4.8=\"\"),\"\",T4.8)","v":""},false,"0/12",null,null,null,null,null,null,null,null,12,0,"","",0,null,null,null,"Brazil","BRA",null,null,null,null,null,null,null,null,null,null,null,null,null,null,null,null,null,null,null,null,"Transparency_accountability","Q2.1","Quelle approche est en vigueur dans votre pays en matière d’élaboration de politiques et de stratégies de collecte de revenus ? Cette approche s'inscrit-elle dans le cadre du processus global d’élaboration et de planification de la mise en œuvre des politiques de financement de la santé ?","",0,false,null,null,"BRN","Brunei Darussalam","WPR","Hi"]
[4.9000000000000004,null,"Q4.9","Dans quelle mesure l’accréditation des prestataires ou les contrats sélectifs sont-ils établis, fonctionnels et utilisés pour les achats ?",0,{"$f":"IF(OR(T4.9=$I$9,T4.9=\"\"),\"\",T4.9)","v":""},false,"0/12",null,null,null,null,null,null,null,null,13,0,"","",0,null,null,null,"Brunei Darussalam","BRN",null,null,null,null,null,null,null,null,null,null,null,null,null,null,null,null,null,null,null,null,"Transparency_accountability","Q2.3","Dans quelle mesure le financement public de la santé dans votre pays est-il prédictible sur plusieurs années ?","",0,false,null,null,"BGR","Bulgaria","EUR","Up-Mid"]
[4.1100000000000003,null,"Q4.10","Dans quelle mesure l’achat et le paiement des produits pharmaceutiques sont-ils mis en œuvre pour promouvoir l’utilisation efficace des médicaments (par exemple le recours aux génériques plutôt qu’aux princeps) et pour améliorer la protection financière des patients ?",0,{"$f":"IF(OR(T4.10=$I$9,T4.10=\"\"),\"\",T4.10)","v":""},false,"0/12",null,null,null,null,null,null,null,null,14,0,"","",0,null,null,null,"Bulgaria","BGR",null,null,null,null,null,null,null,null,null,null,null,null,null,null,null,null,null,null,null,null,"Transparency_accountability","Q4.4","Dans quelle mesure les contrats d’achat précisent-ils des exigences en matière de qualité des soins, y compris la disponibilité et la pertinence des soins, puis vérifient-ils de façon régulière qu’elles sont bien respectées ?","",0,false,null,null,"BFA","Burkina Faso","AFR","Low"]
[5.0999999999999996,"Prestations et droits","Q5.1","Cette question a été maintenant remplacé par l’étape 1 et le tableau de vue d’ensemble et ne constitue donc plus une question distincte. Merci de bien vous assurer que vous avez complété l’étape 1 car cela vous aidera à remplir les questions de cette section.",0,{"$f":"IF(OR(T5.1=$I$8,T5.1=\"\"),\"\",T5.1)","v":""},false,"0/12",null,null,null,null,null,null,null,null,15,0,"","",0,null,null,null,"Burkina Faso","BFA",null,null,null,null,null,null,null,null,null,null,null,null,null,null,null,null,null,null,null,null,"Transparency_accountability","Q4.8","Dans quelle mesure les prestataires jouissent-ils d’une autonomie financière et sont-ils tenus responsables, dans une mesure réaliste et conforme à leurs capacités ?","",0,false,null,null,"BDI","Burundi","AFR","Low"]
[5.2,null,"Q5.2","Dans quelle mesure les décisions et les révisions relatives aux prestations sont-elles prises de manière transparente, sur la base d’un processus clairement défini et de critères convenus, tels que le rapport coût-efficacité, la protection financière, l’impact budgétaire ?",0,{"$f":"IF(OR(T5.2=$I$9,T5.2=\"\"),\"\",T5.2)","v":""},false,"0/12",null,null,null,null,null,null,null,null,16,0,"","",0,null,null,null,"Burundi","BDI",null,null,null,null,null,null,null,null,null,null,null,null,null,null,null,null,null,null,null,null,"Transparency_accountability","Q5.2","Dans quelle mesure les décisions et les révisions relatives aux prestations sont-elles prises de manière transparente, sur la base d’un processus clairement défini et de critères convenus, tels que le rapport coût-efficacité, la protection financière, l’impact budgétaire ?","",0,false,null,null,"CPV","Cabo Verde Republic of","AFR","Low-Mid"]
[5.3,null,"Q5.3","Dans quelle mesure les droits à prestation reflètent-ils explicitement les besoins de santé de la population ?",0,{"$f":"IF(OR(T5.3=$I$9,T5.3=\"\"),\"\",T5.3)","v":""},false,"0/12",null,null,null,null,null,null,null,null,17,0,"","",0,null,null,null,"Cabo Verde Republic of","CPV",null,null,null,null,null,null,null,null,null,null,null,null,null,null,null,null,null,null,null,null,"Transparency_accountability","Q5.5","Dans quelle mesure les droits et obligations de la population sont-ils explicitement définis et compris par les intéressés ?","",0,false,null,null,"KHM","Cambodia","WPR","Low"]
[5.4,null,"Q5.4","Dans quelle mesure les prestations accordent-elles la priorité aux catégories de population prioritaires, par exemple pour une meilleure utilisation des services hautement prioritaires et pour la protection financière ?",0,{"$f":"IF(OR(T5.4=$I$9,T5.4=\"\"),\"\",T5.4)","v":""},false,"0/12",null,null,null,null,null,null,null,null,null,null,"",null,null,null,null,null,"Cambodia","KHM",null,null,null,null,null,null,null,null,null,null,null,null,null,null,null,null,null,null,null,null,"Transparency_accountability","Q5.7","Dans quelle mesure les prestations, y compris le partage des coûts pour les patients, sont-elles alignées sur les recettes, afin d’assurer un financement adéquat des droits à prestations approuvés ?","",0,false,null,null,"CMR","Cameroon","AFR","Low-Mid"]
[5.5,null,"Q5.5","Dans quelle mesure les droits et obligations de la population sont-ils explicitement définis et compris par les intéressés ?",0,{"$f":"IF(OR(T5.5=$I$9,T5.5=\"\"),\"\",T5.5)","v":""},false,"0/12",null,null,null,null,null,null,null,null,null,null,"",null,null,null,null,null,"Cameroon","CMR",null,null,null,null,null,null,null,null,null,null,null,null,null,null,null,null,null,null,null,null,"Transparency_accountability","Q6.5","Dans quelle mesure le processus budgétaire est consultatif, transparent et un processus d’examen et d’ajustement budgétaire à mi-parcours est établi ?","",0,false,null,null,"CAN","Canada","AMR","Hi"]
[5.6,null,"Q5.6","Dans quelle mesure les prestations sont-elles alignées sur le paiement des prestataires, afin de s’assurer qu’elles sont fournies et que les patients bénéficient d’une protection financière ?",0,{"$f":"IF(OR(T5.6=$I$9,T5.6=\"\"),\"\",T5.6)","v":""},false,"0/12",null,null,null,null,null,null,null,null,null,null,"",null,null,null,null,null,"Canada","CAN",null,null,null,null,null,null,null,null,null,null,null,null,null,null,null,null,null,null,null,null,"Transparency_accountability","Q6.7","Dans quelle mesure les règles du budget de la santé permettent-elles une certaine souplesse des dépenses? ","",0,false,null,null,"CAF","Central African Republic","AFR","Low"]
[5.7,null,"Q5.7","Dans quelle mesure les prestations, y compris le partage des coûts pour les patients, sont-elles alignées sur les recettes, afin d’assurer un financement adéquat des droits à prestations approuvés ?",0,{"$f":"IF(OR(T5.7=$I$9,T5.7=\"\"),\"\",T5.7)","v":""},false,"0/12",null,null,null,null,null,null,null,null,null,null,"",null,null,null,null,null,"Central African Republic","CAF",null,null,null,null,null,null,null,null,null,null,null,null,null,null,null,null,null,null,null,null,"Transparency_accountability","Q6.9","Dans quelle mesure des politiques de discipline budgétaire visant à contrôler les dépenses sont en vigueur (par exemple, gestion de la trésorerie, respect des règles d’approvisionnement) et mises en œuvre efficacement?","",0,false,null,null,"TCD","Chad","AFR","Low"]
[6.1,"Gestion des finances publiques (GFP)","Q6.1","Est-ce qu’un diagnostic/une évaluation approfondi(e) des goulets d’étranglement de la GFP dans le secteur de la santé a été effectué(e) récemment, par exemple au cours des trois dernières années ?",0,{"$f":"IF(OR(T6.1=$I$9,T6.1=\"\"),\"\",T6.1)","v":""},false,"0/12",null,null,null,null,null,null,null,null,null,null,"",null,null,null,null,null,"Chad","TCD",null,null,null,null,null,null,null,null,null,null,null,null,null,null,null,null,null,null,null,null,"Transparency_accountability","Q7.1","Dans quelle mesure les rôles et les responsabilités (liés aux objectifs de financement de la santé et au rendement en matière de collecte de recettes, de mise en commun, d’achats, de prestations, etc.) sont clairement définis et répartis entre les institutions responsables du financement de la santé ?","",0,false,null,null,"CHL","Chile","AMR","Hi"]
[6.2,null,"Q6.2","Le personnel du Ministère de la santé dispose-t-il de capacités à comprendre les (nouvelles) règles de GFP et à les appliquer au processus budgétaire du secteur de la santé ?",0,{"$f":"IF(OR(T6.2=$I$9,T6.2=\"\"),\"\",T6.2)","v":""},false,"0/12",null,null,null,null,null,null,null,null,null,null,"",null,null,null,null,null,"Chile","CHL",null,null,null,null,null,null,null,null,null,null,null,null,null,null,null,null,null,null,null,null,"Transparency_accountability","Q7.2","Dans quelle mesure les institutions responsables du financement de la santé disposent-elles de capacités adéquates, notamment en matière de ressources humaines (capacités techniques et managériales) et de TIC ?","",0,false,null,null,"CHN","China","WPR","Up-Mid"]
[6.3,null,"Q6.3","Existe-il un processus budgétaire pluriannuel mis en œuvre efficacement ?",0,{"$f":"IF(OR(T6.3=$I$9,T6.3=\"\"),\"\",T6.3)","v":""},false,"0/12",null,null,null,null,null,null,null,null,null,null,"",null,null,null,null,null,"China","CHN",null,null,null,null,null,null,null,null,null,null,null,null,null,null,null,null,null,null,null,null,"Transparency_accountability","Q7.3","Dans quelle mesure les mécanismes de responsabilisation des organismes d’achat/de financement (y compris l’autonomie et le conseil d’administration de l’agence d’assurance-maladie, les mécanismes de récompense/sanction, etc.) sont-ils en place pour s’assurer que la politique de financement de la santé appuie les progrès vers les objectifs du secteur et que les fonds sont utilisés efficacement pour les populations, programmes et services prioritaires ?","",0,false,null,null,"COL","Colombia","AMR","Up-Mid"]
[6.4,null,"Q6.4","Dans quelle mesure les allocations budgétaires annuelles en matière de santé sont alignées sur les priorités du secteur de la santé (niveau, structure, nature/objectif) ?",0,{"$f":"IF(OR(T6.4=$I$9,T6.4=\"\"),\"\",T6.4)","v":""},false,"0/12",null,null,null,null,null,null,null,null,null,null,"",null,null,null,null,null,"Colombia","COL",null,null,null,null,null,null,null,null,null,null,null,null,null,null,null,null,null,null,null,null,"Transparency_accountability","Q7.4","L’utilisation des fonds ou les performances des institutions achetant des services auprès des prestataires de services de santé ou le budget de la santé ont-ils été communiqués au public (par exemple sous forme de rapport annuel) ?","",0,false,null,null,"COM","Comoros","AFR","Low"]
[6.5,null,"Q6.5","Dans quelle mesure le processus budgétaire est consultatif, transparent et un processus d’examen et d’ajustement budgétaire à mi-parcours est établi ?",0,{"$f":"IF(OR(T6.5=$I$9,T6.5=\"\"),\"\",T6.5)","v":""},false,"0/12",null,null,null,null,null,null,null,null,null,null,"",null,null,null,null,null,"Comoros","COM",null,null,null,null,null,null,null,null,null,null,null,null,null,null,null,null,null,null,null,null,"Transparency_accountability","Q7.5","Dans quelle mesure le Ministère des finances, le Ministère de la santé et l’organisme national d’assurance-maladie participent au processus d’élaboration des politiques de financement de la santé et en sont informés ?","",0,false,null,null,"COG","Congo","AFR","Low-Mid"]
[6.6,null,"Q6.6","Dans quelle mesure les transferts fiscaux sont conçus et mis en œuvre de sorte à améliorer l’équité de la distribution des ressources dans le secteur de la santé?",0,{"$f":"IF(OR(T6.6=$I$9,T6.6=\"\"),\"\",T6.6)","v":""},false,"0/12",null,null,null,null,null,null,null,"Efficience",null,null,null,null,null,null,null,null,"Congo","COG",null,null,null,null,null,null,null,null,null,null,null,null,null,null,null,null,null,null,null,null,"Transparency_accountability","Q7.6","Dans quelle mesure le processus d’élaboration des politiques de financement de la santé est transparent et participatif?","",0,false,null,null,"COK","Cook Islands","WPR","Up-Mid"]
[6.7,null,"Q6.7","Dans quelle mesure les règles du budget de la santé permettent-elles une certaine souplesse des dépenses? ",0,{"$f":"IF(OR(T6.7=$I$9,T6.7=\"\"),\"\",T6.7)","v":""},false,"0/12",null,null,null,null,null,null,null,2.4,"2.4 Dans quelle mesure le flux de fonds publics est-il stable, Serait-ce grâce à une exécution régulière, c’est-à-dire un déblocage des fonds dans les délais, conformément aux budgets de santé approuvés ?",{"$f":"IFERROR(VLOOKUP(P47,$A$8:$E$57,5,0),\"\")","v":0},null,null,null,null,null,null,"Cook Islands","COK",null,null,null,null,null,null,null,null,null,null,null,null,null,null,null,null,null,null,null,null,"Utilization_relative_need ","Q2.3","Dans quelle mesure le financement public de la santé dans votre pays est-il prédictible sur plusieurs années ?","",0,false,null,null,"CRI","Costa Rica","AMR","Up-Mid"]
[6.8,null,"Q6.8","La flexibilité dans l’utilisation des ressources est-elle assurée ou déléguée au bon niveau?",0,{"$f":"IF(OR(T6.8=$I$9,T6.8=\"\"),\"\",T6.8)","v":""},false,"0/12",null,null,null,null,null,null,null,3.2,"3.2 Dans le cadre du processus global d’élaboration et de planification de la mise en œuvre des politiques de financement de la santé, quelle est l’approche de votre pays en matière de dispositifs de mise en commun des recettes ?",0,null,null,null,null,null,null,"Costa Rica","CRI",null,null,null,null,null,null,null,null,null,null,null,null,null,null,null,null,null,null,null,null,"Utilization_relative_need ","Q2.4","Dans quelle mesure le flux de fonds publics est-il stable, notamment grâce à une exécution budgétaire régulière, c’est-à-dire un déblocage des fonds dans les délais, conformément aux budgets de santé approuvés ?","",0,false,null,null,"CIV","Côte d'Ivoire","AFR","Low-Mid"]
[6.9,null,"Q6.9","Dans quelle mesure des politiques de discipline budgétaire visant à contrôler les dépenses sont en vigueur (par exemple, gestion de la trésorerie, respect des règles d’approvisionnement) et mises en œuvre efficacement?",0,{"$f":"IF(OR(T6.9=$I$9,T6.9=\"\"),\"\",T6.9)","v":""},false,"0/12",null,null,null,null,null,null,null,3.3,"3.3 Dans quelle mesure la capacité de redistribution des fonds prépayés dans votre pays est-elle limitée par les accords institutionnels de financement de la santé ?",0,null,null,null,null,null,null,"Côte d'Ivoire","CIV",null,null,null,null,null,null,null,null,null,null,null,null,null,null,null,null,null,null,null,null,"Utilization_relative_need ","Q2.5","Dans quelle mesure les différentes sources de revenus sont-elles collectées de façon progressive (c.-à-d. en fonction de la capacité de payer), et partant de là favorisent l’équité dans le mode de financement du système de santé ?","",0,false,null,null,"HRV","Croatia","EUR","Hi"]
[6.15,null,"Q6.10","Dans quelle mesure des systèmes d’information sont en place pour répondre aux besoins en matière de responsabilité financière et pour assurer le suivi des performances du secteur de la santé?",0,{"$f":"IF(OR(T6.10=$I$9,T6.10=\"\"),\"\",T6.10)","v":""},false,"0/12",null,null,null,null,null,null,null,3.4,"3.4 Y aurait-il des mesures, liées à la conception des prestations, au paiement des prestataires ou à des systèmes sous-jacents non financiers, qui ciblent les problèmes découlant de la fragmentation des caisses ?\n",0,null,null,null,null,null,null,"Croatia","HRV",null,null,null,null,null,null,null,null,null,null,null,null,null,null,null,null,null,null,null,null,"Utilization_relative_need ","Q3.2","Dans le cadre du processus global d’élaboration et de planification de la mise en œuvre des politiques de financement de la santé, quelle est l’approche de votre pays en matière de dispositifs de mise en commun des ressources ?","",0,false,null,null,"CUB","Cuba","AMR","Up-Mid"]
[6.16,null,"Q6.11","Dans quelle mesure les flux financiers multiples, la structure budgétaire et les règles de GFP sont alignés sur les politiques d’achats stratégiques?",0,{"$f":"IF(OR(T6.11=$I$9,T6.11=\"\"),\"\",T6.11)","v":""},false,"0/12",null,null,null,null,null,null,null,3.5,"3.5 Dans quelle mesure les différentes sources de recettes et de financement sont-elles organisées de manière complémentaire, afin de financer un paquet de prestations pour l’ensemble de la population ?",0,null,null,null,null,null,null,"Cuba","CUB",null,null,null,null,null,null,null,null,null,null,null,null,null,null,null,null,null,null,null,null,"Utilization_relative_need ","Q3.3","Dans quelle mesure la capacité de redistribution des fonds prépayés dans votre pays est-elle limitée par le cadre institutionnel du financement de la santé ?","",0,false,null,null,"CYP","Cyprus","EUR","Hi"]
[7.1,"Gouvernance","Q7.1","Dans quelle mesure les rôles et les responsabilités (liés aux objectifs de financement de la santé et au rendement en matière de collecte de recettes, de mise en commun, d’achats, de prestations, etc.) sont clairement définis et répartis entre les institutions responsables du financement de la santé ?",0,{"$f":"IF(OR(T7.1=$I$9,T7.1=\"\"),\"\",T7.1)","v":""},false,"0/12",null,null,null,null,null,null,null,3.7,"3.7 Dans quelle mesure les flux financiers sont-ils incohérents et redondants, et empêchent d’utiliser efficacement le budget public et les fonds des donateurs ?",0,null,null,null,null,null,null,"Cyprus","CYP",null,null,null,null,null,null,null,null,null,null,null,null,null,null,null,null,null,null,null,null,"Utilization_relative_need ","Q3.4","Y-a-il des mesures, dans la conception des prestations, le paiement des prestataires ou les systèmes sous-jacents non financiers, qui visent à contrecarrer les problèmes découlant de la fragmentation de l’architecture du financement de la santé ?","",0,false,null,null,"CZE","Czech Republic","EUR","Hi"]
[7.2,null,"Q7.2","Dans quelle mesure les institutions responsables du financement de la santé disposent-elles de capacités adéquates, notamment en matière de ressources humaines (capacités techniques et managériales) et de TIC ?",0,{"$f":"IF(OR(T7.2=$I$9,T7.2=\"\"),\"\",T7.2)","v":""},false,"0/12",null,null,null,null,null,null,null,4.5,"4.5 Dans quelle mesure les méthodes de paiement des prestataires favorisent-elles l’efficacité de l’allocation des ressources, par exemple en réduisant la prestation excessive ou insuffisante des services, et gèrent-elles la croissance des dépenses ?",0,null,null,null,null,null,null,"Czech Republic","CZE",null,null,null,null,null,null,null,null,null,null,null,null,null,null,null,null,null,null,null,null,"Utilization_relative_need ","Q3.5","Dans quelle mesure les différentes sources de revenus et de financement sont-elles organisées de manière complémentaire, afin de financer un paquet de prestations pour l’ensemble de la population ?","",0,false,null,null,"PRK","Democratic People's Republic of Korea","SEAR","Low"]
[7.3,null,"Q7.3","Dans quelle mesure les mécanismes de responsabilisation des organismes d’achat/de financement (y compris l’autonomie et le conseil d’administration de l’agence d’assurance-maladie, les mécanismes de récompense/sanction, etc.) sont-ils en place pour s’assurer que la politique de financement de la santé appuie les progrès vers les objectifs du secteur et que les fonds sont utilisés efficacement pour les populations, programmes et services prioritaires ?",0,{"$f":"IF(OR(T7.3=$I$9,T7.3=\"\"),\"\",T7.3)","v":""},false,"0/12",null,null,null,null,null,null,null,4.8,"4.8 Dans quelle mesure les prestataires jouissent-ils d’une autonomie financière et sont-ils tenus responsables, dans une mesure réaliste et conforme à leurs capacités ?",0,null,null,null,null,null,null,"Democratic People's Republic of Korea","PRK",null,null,null,null,null,null,null,null,null,null,null,null,null,null,null,null,null,null,null,null,"Utilization_relative_need ","Q4.1","Dans quelle mesure les allocations de fonds aux acheteurs de niveau inférieur, par exemple les administrations locales, et/ou les taux de paiement aux prestataires sont-ils le reflet des besoins de santé de la population ?","",0,false,null,null,"COD","Democratic Republic of the Congo","AFR","Low"]
[7.4,null,"Q7.4","L’utilisation des fonds ou les performances des institutions achetant des services auprès des prestataires de services de santé ou le budget de la santé ont-ils été communiqués au public (par exemple sous forme de rapport annuel) ?",0,{"$f":"IF(OR(T7.4=$I$9,T7.4=\"\"),\"\",T7.4)","v":""},false,"0/12",null,null,null,null,null,null,null,4.9000000000000004,"4.9 Dans quelle mesure l’accréditation des prestataires ou les contrats sélectifs sont-ils établis, fonctionnels et utilisés pour les achats ?",0,null,null,null,null,null,null,"Democratic Republic of the Congo","COD",null,null,null,null,null,null,null,null,null,null,null,null,null,null,null,null,null,null,null,null,"Utilization_relative_need ","Q5.3","Dans quelle mesure les droits à prestation reflètent-ils explicitement les besoins de santé de la population ?","",0,false,null,null,"DNK","Denmark","EUR","Hi"]
[7.5,null,"Q7.5","Dans quelle mesure le Ministère des finances, le Ministère de la santé et l’organisme national d’assurance-maladie participent au processus d’élaboration des politiques de financement de la santé et en sont informés ?",0,{"$f":"IF(OR(T7.5=$I$9,T7.5=\"\"),\"\",T7.5)","v":""},false,"0/12",null,null,null,null,null,null,null,4.1100000000000003,"4.10 Dans quelle mesure l’achat et le paiement des produits pharmaceutiques sont-ils mis en œuvre pour promouvoir l’utilisation efficace des médicaments (par ex. le recours aux génériques plutôt qu’aux princeps) et pour améliorer la protection financière des patients ?",0,null,null,null,null,null,null,"Denmark","DNK",null,null,null,null,null,null,null,null,null,null,null,null,null,null,null,null,null,null,null,null,"Utilization_relative_need ","Q5.4","Dans quelle mesure les prestations accordent-elles la priorité aux catégories de population prioritaires, par exemple pour une meilleure utilisation des services hautement prioritaires et pour la protection financière ?","",0,false,null,null,"DJI","Djibouti","EMR","Low-Mid"]
[7.6,null,"Q7.6","Dans quelle mesure le processus d’élaboration des politiques de financement de la santé est transparent et participatif?",0,{"$f":"IF(OR(T7.6=$I$9,T7.6=\"\"),\"\",T7.6)","v":""},false,"0/12",null,null,null,null,null,null,null,6.7,"6.7 Dans quelle mesure les règles du budget de la santé permettent-elles une certaine souplesse des dépenses? ",0,null,null,null,null,null,null,"Djibouti","DJI",null,null,null,null,null,null,null,null,null,null,null,null,null,null,null,null,null,null,null,null,"Utilization_relative_need ","Q5.5","Dans quelle mesure les droits et obligations de la population sont-ils explicitement définis et compris par les intéressés ?","",0,false,null,null,"DMA","Dominica","AMR","Up-Mid"]
[null,null,null,null,null,null,null,null,null,null,null,null,null,null,null,6.8,"6.8 La flexibilité dans l’utilisation des ressources est-elle assurée ou déléguée au bon niveau?",0,null,null,null,null,null,null,"Dominica","DMA",null,null,null,null,null,null,null,null,null,null,null,null,null,null,null,null,null,null,null,null,"Utilization_relative_need ","Q5.6","Dans quelle mesure les prestations sont-elles alignées sur le paiement des prestataires, afin de s’assurer qu’elles sont fournies et que les patients bénéficient d’une protection financière ?","",0,false,null,null,"DOM","Dominican Republic","AMR","Up-Mid"]
[null,null,null,null,null,null,null,null,null,null,null,null,null,null,null,6.9,"6.9 Dans quelle mesure des politiques de discipline budgétaire visant à contrôler les dépenses sont en rn vigueur (par ex. gestion de la trésorerie, respect des règles d’approvisionnement) et mises en œuvre efficacement?",0,null,null,null,null,null,null,"Dominican Republic","DOM",null,null,null,null,null,null,null,null,null,null,null,null,null,null,null,null,null,null,null,null,"Utilization_relative_need ","Q5.7","Dans quelle mesure les prestations, y compris le partage des coûts pour les patients, sont-elles alignées sur les recettes, afin d’assurer un financement adéquat des droits à prestations approuvés ?","",0,false,null,null,"ECU","Ecuador","AMR","Up-Mid"]
[null,null,null,null,null,null,null,null,null,null,null,null,null,null,null,6.16,"6.11 Dans quelle mesure les flux financiers multiples, la structure budgétaire et les règles de GFP sont alignés sur les politiques d’achats stratégiques?",0,null,null,null,null,null,null,"Ecuador","ECU",null,null,null,null,null,null,null,null,null,null,null,null,null,null,null,null,null,null,null,null,"Utilization_relative_need ","Q6.4","Dans quelle mesure les allocations budgétaires annuelles en matière de santé sont alignées sur les priorités du secteur de la santé (niveau, structure, nature/objectif) ?","",0,false,null,null,"EGY","Egypt","EMR","Low-Mid"]
["Answer Annex",null,null,null,null,null,null,null,null,null,null,null,null,null,null,null,null,null,null,null,null,null,null,null,"Egypt","EGY",null,null,null,null,null,null,null,null,null,null,null,null,null,null,null,null,null,null,null,null,"Utilization_relative_need ","Q6.6","Dans quelle mesure les transferts fiscaux sont conçus et mis en œuvre de sorte à améliorer l’équité de la distribution des ressources dans le secteur de la santé?","",0,false,null,null,"SLV","El Salvador","AMR","Low-Mid"]
[null,1,2,3,4,5,6,null,null,null,null,null,null,null,null,null,null,null,null,null,null,null,null,null,"El Salvador","SLV",null,null,null,null,null,null,null,null,null,null,null,null,null,null,null,null,null,null,null,null,"Utilization_relative_need ","Q6.7","Dans quelle mesure les règles du budget de la santé permettent-elles une certaine souplesse des dépenses? ","",0,false,null,null,"GNQ","Equatorial Guinea","AFR","Hi"]
["CRITERIA","HEALTH INSURANCE SCHEME\n(add specific name in your country)","OTHER COVERAGE SCHEME \n(add specific name in your country)","OTHER COVERAGE SCHEME\n(add specific name in your country)","OTHER COVERAGE SCHEME\n(add specific name in your country)","OTHER COVERAGE SCHEME\n(add specific name in your country)","OTHER COVERAGE SCHEME\n(add specific name in your country)",null,null,null,null,null,null,null,null,"Équité dans la distribution des ressources",null,null,null,null,null,null,null,null,"Equatorial Guinea","GNQ",null,null,null,null,null,null,null,null,null,null,null,null,null,null,null,null,null,null,null,null,"Utilization_relative_need ","Q6.11","Dans quelle mesure les flux financiers multiples, la structure budgétaire et les règles de GFP sont alignés sur les politiques d’achats stratégiques?","",0,false,null,null,"ERI","Eritrea","AFR","Low"]
[{"$f":"Etape_1_Resume!C6","v":"POPULATION CIBLE\nTous les citoyens sont-ils couverts ou un sous-groupe spécifique, par exemple moins de 5 ans, salariés?\n"},{"$f":"IF(QA.1.1=\"\",\"\",QA.1.1)","v":""},{"$f":"IF(QA.2.1=\"\",\"\",QA.2.1)","v":""},{"$f":"IF(QA.3.1=\"\",\"\",QA.3.1)","v":""},{"$f":"IF(QA.4.1=\"\",\"\",QA.4.1)","v":""},{"$f":"IF(QA.5.1=\"\",\"\",QA.5.1)","v":""},{"$f":"IF(QA.6.1=\"\",\"\",QA.6.1)","v":""},1,null,null,null,null,null,null,null,3.2,"3.2 Dans le cadre du processus global d’élaboration et de planification de la mise en œuvre des politiques de financement de la santé, quelle est l’approche de votre pays en matière de dispositifs de mise en commun des recettes ?",{"$f":"IFERROR(VLOOKUP(P64,$A$8:$E$57,5,0),\"\")","v":0},null,null,null,null,null,null,"Eritrea","ERI",null,"France","FRA","FRA       ",null,null,null,null,null,null,null,null,null,null,null,null,null,null,null,null,"Financial_protection ","Q2.1","Quelle approche est en vigueur dans votre pays en matière d’élaboration de politiques et de stratégies de collecte de revenus ? Cette approche s'inscrit-elle dans le cadre du processus global d’élaboration et de planification de la mise en œuvre des politiques de financement de la santé ?","",0,false,null,null,"EST","Estonia","EUR","Hi"]
[{"$f":"Etape_1_Resume!C7","v":"POPULATION COUVERTE / souscrite\nNombre réel relatif à la pop cible.\n"},{"$f":"IF(QA.1.2=\"\",\"\",QA.1.2)","v":""},{"$f":"IF(QA.2.2=\"\",\"\",QA.2.2)","v":""},{"$f":"IF(QA.3.2=\"\",\"\",QA.3.2)","v":""},{"$f":"IF(QA.4.2=\"\",\"\",QA.4.2)","v":""},{"$f":"IF(QA.5.2=\"\",\"\",QA.5.2)","v":""},{"$f":"IF(QA.6.2=\"\",\"\",QA.6.2)","v":""},2,null,null,null,null,null,null,null,3.3,"3.3 Dans quelle mesure la capacité de redistribution des fonds prépayés dans votre pays est-elle limitée par les accords institutionnels de financement de la santé ?",0,null,null,null,null,null,null,"Estonia","EST",null,"Gabon","GAB","GAB       ",null,null,null,null,null,null,null,null,null,null,null,null,null,null,null,null,"Financial_protection ","Q2.2","Dans quelle mesure le financement de la santé dans votre pays repose-t-il sur des sources de financement public/obligatoire (par exemple, fiscalité/recettes publiques, y compris les cotisations obligatoires à l’assurance-maladie nationale/sociale) ?","",0,false,null,null,"ETH","Ethiopia","AFR","Low"]
[{"$f":"Etape_1_Resume!C8","v":"BASE DE COUVERTURE / SOUSCRIPTION\nPar exemple. obligatoire, automatique, volontaire\n"},{"$f":"IF(QA.1.3=\"\",\"\",QA.1.3)","v":""},{"$f":"IF(QA.2.3=\"\",\"\",QA.2.3)","v":""},{"$f":"IF(QA.3.3=\"\",\"\",QA.3.3)","v":""},{"$f":"IF(QA.4.3=\"\",\"\",QA.4.3)","v":""},{"$f":"IF(QA.5.3=\"\",\"\",QA.5.3)","v":""},{"$f":"IF(QA.6.3=\"\",\"\",QA.6.3)","v":""},3,null,null,null,null,null,null,null,3.4,"3.4 Y aurait-il des mesures, liées à la conception des prestations, au paiement des prestataires ou à des systèmes sous-jacents non financiers, qui ciblent les problèmes découlant de la fragmentation des caisses ?\n",0,null,null,null,null,null,null,"Ethiopia","ETH",null,"Gambia","GAM","GMB       ",null,null,null,null,null,null,null,null,null,null,null,null,null,null,null,null,"Financial_protection ","Q2.4","Dans quelle mesure le flux de fonds publics est-il stable, notamment grâce à une exécution budgétaire régulière, c’est-à-dire un déblocage des fonds dans les délais, conformément aux budgets de santé approuvés ?","",0,false,null,null,"FJI","Fiji","WPR","Up-Mid"]
[{"$f":"Etape_1_Resume!C9","v":"AVANTAGES / DROITS\nUne liste de services ou niveau de soins est-elle définie? Est-ce que les utilisateurs doivent faire des co-paiements?\n"},{"$f":"IF(QA.1.4=\"\",\"\",QA.1.4)","v":""},{"$f":"IF(QA.2.4=\"\",\"\",QA.2.4)","v":""},{"$f":"IF(QA.3.4=\"\",\"\",QA.3.4)","v":""},{"$f":"IF(QA.4.4=\"\",\"\",QA.4.4)","v":""},{"$f":"IF(QA.5.4=\"\",\"\",QA.5.4)","v":""},{"$f":"IF(QA.6.4=\"\",\"\",QA.6.4)","v":""},4,null,null,null,null,null,null,null,3.5,"3.5 Dans quelle mesure les différentes sources de recettes et de financement sont-elles organisées de manière complémentaire, afin de financer un paquet de prestations pour l’ensemble de la population ?",0,null,null,null,null,null,null,"Fiji","FJI",null,"Georgia","GEO","GEO       ",null,null,null,null,null,null,null,null,null,null,null,null,null,null,null,null,"Financial_protection ","Q2.5","Dans quelle mesure les différentes sources de revenus sont-elles collectées de façon progressive (c.-à-d. en fonction de la capacité de payer), et partant de là favorisent l’équité dans le mode de financement du système de santé ?","",0,false,null,null,"FIN","Finland","EUR","Hi"]
[{"$f":"Etape_1_Resume!C10","v":"SOURCES DE REVENUS\nD'où vient l'argent? Allocations / transferts budgétaires; contributions prépayées.\n"},{"$f":"IF(QA.1.5=\"\",\"\",QA.1.5)","v":""},{"$f":"IF(QA.2.5=\"\",\"\",QA.2.5)","v":""},{"$f":"IF(QA.3.5=\"\",\"\",QA.3.5)","v":""},{"$f":"IF(QA.4.5=\"\",\"\",QA.4.5)","v":""},{"$f":"IF(QA.5.5=\"\",\"\",QA.5.5)","v":""},{"$f":"IF(QA.6.5=\"\",\"\",QA.6.5)","v":""},5,null,null,null,null,null,null,null,3.6,"3.6 Dans quelle mesure les dispositifs d’assurance-maladie volontaire sont-ils une source d’inégalités, créant des effets de contagion potentiellement néfastes pour l’ensemble du système de santé ?",0,null,null,null,null,null,null,"Finland","FIN",null,"Germany","DEU","DEU       ",null,null,null,null,null,null,null,null,null,null,null,null,null,null,null,null,"Financial_protection ","Q3.2","Dans le cadre du processus global d’élaboration et de planification de la mise en œuvre des politiques de financement de la santé, quelle est l’approche de votre pays en matière de dispositifs de mise en commun des ressources ?","",0,false,null,null,"FRA","France","EUR","Hi"]
[{"$f":"Etape_1_Resume!C11","v":"ACCORDS DE MISE EN COMMUN\nLe budget de la santé est-il alloué aux autorités régionales, existe-t-il un ou plusieurs fonds d '«assurance»?\n"},{"$f":"IF(QA.1.6=\"\",\"\",QA.1.6)","v":""},{"$f":"IF(QA.2.6=\"\",\"\",QA.2.6)","v":""},{"$f":"IF(QA.3.6=\"\",\"\",QA.3.6)","v":""},{"$f":"IF(QA.4.6=\"\",\"\",QA.4.6)","v":""},{"$f":"IF(QA.5.6=\"\",\"\",QA.5.6)","v":""},{"$f":"IF(QA.6.6=\"\",\"\",QA.6.6)","v":""},6,null,null,null,null,null,null,null,4.0999999999999996,"4.1 Dans quelle mesure les allocations de fonds aux acheteurs de niveau inférieur, par exemple les administrations locales, et/ou les taux de paiement aux prestataires sont-ils le reflet des besoins de santé de la population ?\n",0,null,null,null,null,null,null,"France","FRA",null,"Ghana","GHA","GHA       ",null,null,null,null,null,null,null,null,null,null,null,null,null,null,null,null,"Financial_protection ","Q3.3","Dans quelle mesure la capacité de redistribution des fonds prépayés dans votre pays est-elle limitée par le cadre institutionnel du financement de la santé ?","",0,false,null,null,"GAB","Gabon","AFR","Up-Mid"]
[{"$f":"Etape_1_Resume!C12","v":"MODALITES D'ACHAT\nDécrivez les arrangements de gestion et de gouvernance?\n"},{"$f":"IF(QA.1.7=\"\",\"\",QA.1.7)","v":""},{"$f":"IF(QA.2.7=\"\",\"\",QA.2.7)","v":""},{"$f":"IF(QA.3.7=\"\",\"\",QA.3.7)","v":""},{"$f":"IF(QA.4.7=\"\",\"\",QA.4.7)","v":""},{"$f":"IF(QA.5.7=\"\",\"\",QA.5.7)","v":""},{"$f":"IF(QA.6.7=\"\",\"\",QA.6.7)","v":""},7,null,null,null,null,null,null,null,4.2,"4.2 Dans quelle mesure les paiements des prestataires sont-ils harmonisés entre régimes/sources de recettes et entre secteurs public et privé, afin de garantir des incitations cohérentes aux prestataires ?",0,null,null,null,null,null,null,"Gabon","GAB",null,"Greece","GRE","GRC       ",null,null,null,null,null,null,null,null,null,null,null,null,null,null,null,null,"Financial_protection ","Q3.4","Y-a-il des mesures, dans la conception des prestations, le paiement des prestataires ou les systèmes sous-jacents non financiers, qui visent à contrecarrer les problèmes découlant de la fragmentation de l’architecture du financement de la santé ?","",0,false,null,null,"GMB","Gambia","AFR","Low"]
[{"$f":"Etape_1_Resume!C13","v":"PAIEMENT DU FOURNISSEUR\nPar exemple. les entrées par ligne ou poste budgétaire; Ticket de soins/Service, paiement au cas par cas, capitation, basé sur performances?\n"},{"$f":"IF(QA.1.8=\"\",\"\",QA.1.8)","v":""},{"$f":"IF(QA.2.8=\"\",\"\",QA.2.8)","v":""},{"$f":"IF(QA.3.8=\"\",\"\",QA.3.8)","v":""},{"$f":"IF(QA.4.8=\"\",\"\",QA.4.8)","v":""},{"$f":"IF(QA.5.8=\"\",\"\",QA.5.8)","v":""},{"$f":"IF(QA.6.8=\"\",\"\",QA.6.8)","v":""},null,null,null,null,null,null,null,null,6.4,"6.4 Mesure dans laquelle les allocations budgétaires annuelles en matière de santé sont alignées sur les priorités du secteur de la santé (niveau, structure, nature/objectif)",0,null,null,null,null,null,null,"Gambia","GMB",null,null,null,null,null,null,null,null,null,null,null,null,null,null,null,null,null,null,null,null,"Financial_protection ","Q3.5","Dans quelle mesure les différentes sources de revenus et de financement sont-elles organisées de manière complémentaire, afin de financer un paquet de prestations pour l’ensemble de la population ?","",0,false,null,null,"GEO","Georgia","EUR","Low-Mid"]
[{"$f":"Etape_1_Resume!C14","v":"PRESTATION DE SERVICES & CONTRACTUALISATION\nDe quels fournisseurs les services sont-ils achetés? Public-privé? Des contrats / accords de services sont-ils utilisés?\n"},{"$f":"IF(QA.1.9=\"\",\"\",QA.1.9)","v":""},{"$f":"IF(QA.2.9=\"\",\"\",QA.2.9)","v":""},{"$f":"IF(QA.3.9=\"\",\"\",QA.3.9)","v":""},{"$f":"IF(QA.4.9=\"\",\"\",QA.4.9)","v":""},{"$f":"IF(QA.5.9=\"\",\"\",QA.5.9)","v":""},{"$f":"IF(QA.6.9=\"\",\"\",QA.6.9)","v":""},null,null,null,null,null,null,null,null,6.6,"6.6 Dans quelle mesure les transferts fiscaux sont conçus et mis en œuvre de sorte à améliorer l’équité de la distribution des ressources dans le secteur de la santé?",0,null,null,null,null,null,null,"Georgia","GEO",null,null,null,null,null,null,null,null,null,null,null,null,null,null,null,null,null,null,null,null,"Financial_protection ","Q3.6",{"$f":"VLOOKUP(AV72,$C$8:$G$57,2,0)","v":"Dans quelle mesure les dispositifs d’assurance-maladie volontaire sont-ils une source d’inégalités, créant des effets de contagion potentiellement néfastes pour l’ensemble du système de santé ?"},{"$f":"VLOOKUP(AV72,$C$8:$G$57,4,0)","v":""},{"$f":"VLOOKUP(AV72,$C$8:$G$57,3,0)","v":0},{"$f":"VLOOKUP(AV72,$C$8:$G$57,5,0)","v":false},null,null,"DEU","Germany","EUR","Hi"]
[null,null,{"$f":"9-COUNTBLANK(C64:C72)","v":0},{"$f":"9-COUNTBLANK(D64:D72)","v":0},{"$f":"9-COUNTBLANK(E64:E72)","v":0},{"$f":"9-COUNTBLANK(F64:F72)","v":0},{"$f":"9-COUNTBLANK(G64:G72)","v":0},null,null,null,null,null,null,null,null,6.16,"6.11 Dans quelle mesure les flux financiers multiples, la structure budgétaire et les règles de GFP sont alignés sur les politiques d’achats stratégiques?",0,null,null,null,null,null,null,"Germany","DEU",null,null,null,null,null,null,null,null,null,null,null,null,null,null,null,null,null,null,null,null,"Financial_protection ","Q4.10","Dans quelle mesure l’achat et le paiement des produits pharmaceutiques sont-ils mis en œuvre pour promouvoir l’utilisation efficace des médicaments (par exemple le recours aux génériques plutôt qu’aux princeps) et pour améliorer la protection financière des patients ?","",0,false,null,null,"GHA","Ghana","AFR","Low-Mid"]
[null,null,null,null,null,null,null,null,null,null,null,null,null,null,null,null,null,null,null,null,null,null,null,null,"Ghana","GHA",null,null,null,null,null,null,null,null,null,null,null,null,null,null,null,null,null,null,null,null,"Financial_protection ","Q5.4","Dans quelle mesure les prestations accordent-elles la priorité aux catégories de population prioritaires, par exemple pour une meilleure utilisation des services hautement prioritaires et pour la protection financière ?","",0,false,null,null,"GRC","Greece","EUR","Hi"]
[null,null,null,null,null,null,null,null,null,null,null,null,null,null,null,"Transparence et responsabilité",null,null,null,null,null,null,null,null,"Greece","GRC",null,null,null,null,null,null,null,null,null,null,null,null,null,null,null,null,null,null,null,null,"Financial_protection ","Q5.6","Dans quelle mesure les prestations sont-elles alignées sur le paiement des prestataires, afin de s’assurer qu’elles sont fournies et que les patients bénéficient d’une protection financière ?","",0,false,null,null,"GRD","Grenada","AMR","Up-Mid"]
[null,null,null,null,null,null,null,null,null,null,null,null,null,null,null,2.1,"2.1 Quelle approche en matière d’élaboration de politiques et de stratégies de collecte de recettes est en vigueur dans votre pays? Cette approche s'inscrit-elle dans le cadre d’un processus global d’élaboration et de planification de la mise en œuvre des politiques de financement de la santé ?",{"$f":"IFERROR(VLOOKUP(P76,$A$8:$E$57,5,0),\"\")","v":0},null,null,null,null,null,null,"Grenada","GRD",null,null,null,null,null,null,null,null,null,null,null,null,null,null,null,null,null,null,null,null,"Equity_finance ","Q2.1","Quelle approche est en vigueur dans votre pays en matière d’élaboration de politiques et de stratégies de collecte de revenus ? Cette approche s'inscrit-elle dans le cadre du processus global d’élaboration et de planification de la mise en œuvre des politiques de financement de la santé ?","",0,false,null,null,"GTM","Guatemala","AMR","Low-Mid"]
[null,null,null,null,null,null,null,null,null,null,null,null,null,null,null,2.2999999999999998,"2.3 Dans quelle mesure le financement public de la santé dans votre pays est-il prévisible sur plusieurs années ?",0,null,null,null,null,null,null,"Guatemala","GTM",null,null,null,null,null,null,null,null,null,null,null,null,null,null,null,null,null,null,null,null,"Equity_finance ","Q2.2","Dans quelle mesure le financement de la santé dans votre pays repose-t-il sur des sources de financement public/obligatoire (par exemple, fiscalité/recettes publiques, y compris les cotisations obligatoires à l’assurance-maladie nationale/sociale) ?","",0,false,null,null,"GIN","Guinea","AFR","Low"]
[null,null,null,null,null,null,null,null,null,null,null,null,null,null,null,4.4000000000000004,"4.4 Dans quelle mesure les contrats d’achat précisent-ils des exigences en matière de qualité des soins, y compris la disponibilité et la pertinence des soins, puis vérifient-ils de façon régulière qu’elles sont bien respectées ?",0,null,null,null,null,null,null,"Guinea","GIN",null,null,null,null,null,null,null,null,null,null,null,null,null,null,null,null,null,null,null,null,"Equity_finance ","Q2.4","Dans quelle mesure le flux de fonds publics est-il stable, notamment grâce à une exécution budgétaire régulière, c’est-à-dire un déblocage des fonds dans les délais, conformément aux budgets de santé approuvés ?","",0,false,null,null,"GNB","Guinea-Bissau","AFR","Low"]
[null,null,null,null,null,null,null,null,null,null,null,null,null,null,null,4.8,"4.8 Dans quelle mesure les prestataires jouissent-ils d’une autonomie financière et sont-ils tenus responsables, dans une mesure réaliste et conforme à leurs capacités ?",0,null,null,null,null,null,null,"Guinea-Bissau","GNB",null,null,null,null,null,null,null,null,null,null,null,null,null,null,null,null,null,null,null,null,"Equity_finance ","Q2.5","Dans quelle mesure les différentes sources de revenus sont-elles collectées de façon progressive (c.-à-d. en fonction de la capacité de payer), et partant de là favorisent l’équité dans le mode de financement du système de santé ?","",0,false,null,null,"GUY","Guyana","AMR","Low-Mid"]
[null,null,null,null,null,null,null,null,null,null,null,null,null,null,null,5.2,"5.2 Dans quelle mesure les décisions et les révisions relatives aux prestations sont-elles prises de manière transparente, sur la base d’un processus clairement défini et de critères convenus, tels que le rapport coût-efficacité, la protection financière, l’impact budgétaire ?",0,null,null,null,null,null,null,"Guyana","GUY",null,null,null,null,null,null,null,null,null,null,null,null,null,null,null,null,null,null,null,null,"Equity_finance ","Q3.4","Y-a-il des mesures, dans la conception des prestations, le paiement des prestataires ou les systèmes sous-jacents non financiers, qui visent à contrecarrer les problèmes découlant de la fragmentation de l’architecture du financement de la santé ?","",0,false,null,null,"HTI","Haiti","AMR","Low"]
[null,null,null,null,null,null,null,null,null,null,null,null,null,null,null,5.5,"5.5 Dans quelle mesure les droits et obligations de la population sont-ils explicitement définis et compris par les intéressés ?",0,null,null,null,null,null,null,"Haiti","HTI",null,null,null,null,null,null,null,null,null,null,null,null,null,null,null,null,null,null,null,null,"Equity_finance ","Q3.6","Dans quelle mesure les dispositifs d’assurance-maladie volontaire sont-ils une source d’inégalités, créant des effets de contagion potentiellement néfastes pour l’ensemble du système de santé ?","",0,false,null,null,"HND","Honduras","AMR","Low-Mid"]
[null,null,null,null,null,null,null,null,null,null,null,null,null,null,null,5.7,"5.7 Dans quelle mesure les prestations, y compris le partage des coûts pour les patients, sont-elles alignées sur les recettes, afin d’assurer un financement adéquat des droits à prestations approuvés ?",0,null,null,null,null,null,null,"Honduras","HND",null,null,null,null,null,null,null,null,null,null,null,null,null,null,null,null,null,null,null,null,"Equity_finance ","Q4.10","Dans quelle mesure l’achat et le paiement des produits pharmaceutiques sont-ils mis en œuvre pour promouvoir l’utilisation efficace des médicaments (par exemple le recours aux génériques plutôt qu’aux princeps) et pour améliorer la protection financière des patients ?","",0,false,null,null,"HUN","Hungary","EUR","Up-Mid"]
[null,null,null,null,null,null,null,null,null,null,null,null,null,null,null,6.5,"6.5 Mesure dans laquelle le processus budgétaire est consultatif, transparent et un processus d’examen et d’ajustement budgétaire à mi-parcours est établi.",0,null,null,null,null,null,null,"Hungary","HUN",null,null,null,null,null,null,null,null,null,null,null,null,null,null,null,null,null,null,null,null,"Equity_finance ","Q5.4","Dans quelle mesure les prestations accordent-elles la priorité aux catégories de population prioritaires, par exemple pour une meilleure utilisation des services hautement prioritaires et pour la protection financière ?","",0,false,null,null,"ISL","Iceland","EUR","Hi"]
[null,null,null,null,null,null,null,null,null,null,null,null,null,null,null,6.7,"6.7 Dans quelle mesure les règles du budget de la santé permettent-elles une certaine souplesse des dépenses? ",0,null,null,null,null,null,null,"Iceland","ISL",null,null,null,null,null,null,null,null,null,null,null,null,null,null,null,null,null,null,null,null,"Equity_finance ","Q5.6","Dans quelle mesure les prestations sont-elles alignées sur le paiement des prestataires, afin de s’assurer qu’elles sont fournies et que les patients bénéficient d’une protection financière ?","",0,false,null,null,"IND","India","SEAR","Low-Mid"]
[null,null,null,null,null,null,null,null,null,null,null,null,null,null,null,6.9,"6.9 Dans quelle mesure des politiques de discipline budgétaire visant à contrôler les dépenses sont en rn vigueur (par ex. gestion de la trésorerie, respect des règles d’approvisionnement) et mises en œuvre efficacement?",0,null,null,null,null,null,null,"India","IND",null,null,null,null,null,null,null,null,null,null,null,null,null,null,null,null,null,null,null,null,"Quality","Q4.2","Dans quelle mesure les paiements des prestataires sont-ils harmonisés entre régimes/sources de revenus et entre secteurs public et privé, afin de garantir des incitations cohérentes aux prestataires ?","",0,false,null,null,"IDN","Indonesia","SEAR","Low-Mid"]
[null,null,null,null,null,null,null,null,null,null,null,null,null,null,null,7.1,"7.1 Dans quelle mesure les rôles et les responsabilités (liés aux objectifs de financement de la santé et au rendement en matière de collecte de recettes, de mise en commun, d’achats, de prestations, etc.) sont clairement définis et répartis entre les institutions responsables du financement de la santé.",0,null,null,null,null,null,null,"Indonesia","IDN",null,null,null,null,null,null,null,null,null,null,null,null,null,null,null,null,null,null,null,null,"Quality","Q4.3","Dans quelle mesure les méthodes de paiement des prestataires et les achats en général favorisent-ils la qualité des soins et la coordination des soins entre les spécialités et les différents niveaux de soins ?","",0,false,null,null,"IRN","Iran (Islamic Republic of)","EMR","Up-Mid"]
[null,null,null,null,null,null,null,null,null,null,null,null,null,null,null,7.2,"7.2 Dans quelle mesure les institutions responsables du financement de la santé disposent-elles de capacités adéquates, notamment en matière de ressources humaines (capacités techniques et managériales) et de TIC ?",0,null,null,null,null,null,null,"Iran (Islamic Republic of)","IRN",null,null,null,null,null,null,null,null,null,null,null,null,null,null,null,null,null,null,null,null,"Quality","Q4.4","Dans quelle mesure les contrats d’achat précisent-ils des exigences en matière de qualité des soins, y compris la disponibilité et la pertinence des soins, puis vérifient-ils de façon régulière qu’elles sont bien respectées ?","",0,false,null,null,"IRQ","Iraq","EMR","Up-Mid"]
[null,null,null,null,null,null,null,null,null,null,null,null,null,null,null,7.3,"7.3 Dans quelle mesure les mécanismes de responsabilisation des organismes d’achat/de financement, y compris l’autonomie et le conseil d’administration de l’agence d’assurance-maladie, les mécanismes de récompense/sanction, etc. sont en place pour s’assurer que la politique de financement de la santé appuie les progrès vers les objectifs du secteur et que les fonds sont utilisés efficacement pour les populations, programmes et services prioritaires.",0,null,null,null,null,null,null,"Iraq","IRQ",null,null,null,null,null,null,null,null,null,null,null,null,null,null,null,null,null,null,null,null,"Quality","Q4.6","Dans quelle mesure les formulaires de consultation des patients sont-ils normalisés dans l'ensemble du système de santé et utilisés pour analyser et évaluer l'activité de l’ensemble des prestataires et de la population ","",0,false,null,null,"IRL","Ireland","EUR","Hi"]
[null,null,null,null,null,null,null,null,null,null,null,null,null,null,null,7.4,"7.4 L’utilisation des fonds ou les performances des institutions achetant des services auprès des prestataires de services de santé ou le budget de la santé ont-ils été communiqués au public (par ex. rapport annuel) ?",0,null,null,null,null,null,null,"Ireland","IRL",null,null,null,null,null,null,null,null,null,null,null,null,null,null,null,null,null,null,null,null,"Quality","Q4.7","Dans quelle mesure les paiements des prestataires  couvrent  uniquement une partie ou l’ensemble des coûts totaux (y compris les salaires, les dépenses récurrentes, etc.) ?","",0,false,null,null,"ISR","Israel","EUR","Hi"]
[null,null,null,null,null,null,null,null,null,null,null,null,null,null,null,7.5,"7.5 Dans quelle mesure le Ministère des finances, le Ministère de la santé et l’organisme national d’assurance-maladie participent au processus d’élaboration des politiques de financement de la santé et en sont informés.",0,null,null,null,null,null,null,"Israel","ISR",null,null,null,null,null,null,null,null,null,null,null,null,null,null,null,null,null,null,null,null,"Quality","Q4.8","Dans quelle mesure les prestataires jouissent-ils d’une autonomie financière et sont-ils tenus responsables, dans une mesure réaliste et conforme à leurs capacités ?","",0,false,null,null,"ITA","Italy","EUR","Hi"]
[null,null,null,null,null,null,null,null,null,null,null,null,null,null,null,7.6,"7.6 Dans quelle mesure le processus d’élaboration des politiques de financement de la santé est transparent et participatif?",0,null,null,null,null,null,null,"Italy","ITA",null,null,null,null,null,null,null,null,null,null,null,null,null,null,null,null,null,null,null,null,"Quality","Q4.9","Dans quelle mesure l’accréditation des prestataires ou les contrats sélectifs sont-ils établis, fonctionnels et utilisés pour les achats ?","",0,false,null,null,"JAM","Jamaica","AMR","Up-Mid"]
[null,null,null,null,null,null,null,null,null,null,null,null,null,null,null,null,null,null,null,null,null,null,null,null,"Jamaica","JAM",null,null,null,null,null,null,null,null,null,null,null,null,null,null,null,null,null,null,null,null,"Quality","Q7.2","Dans quelle mesure les institutions responsables du financement de la santé disposent-elles de capacités adéquates, notamment en matière de ressources humaines (capacités techniques et managériales) et de TIC ?","",0,false,null,null,"JPN","Japan","WPR","Hi"]
[null,null,null,null,null,null,null,null,null,null,null,null,null,null,null,"Équité des financements",null,null,null,null,null,null,null,null,"Japan","JPN",null,null,null,null,null,null,null,null,null,null,null,null,null,null,null,null,null,null,null,null,null,null,null,null,null,null,null,null,"JOR","Jordan","EMR","Up-Mid"]
[null,null,null,null,null,null,null,null,null,null,null,null,null,null,null,2.1,"2.1 Quelle approche en matière d’élaboration de politiques et de stratégies de collecte de recettes est en vigueur dans votre pays? Cette approche s'inscrit-elle dans le cadre d’un processus global d’élaboration et de planification de la mise en œuvre des politiques de financement de la santé ?",{"$f":"IFERROR(VLOOKUP(P94,$A$8:$E$57,5,0),\"\")","v":0},null,null,null,null,null,null,"Jordan","JOR",null,null,null,null,null,null,null,null,null,null,null,null,null,null,null,null,null,null,null,null,null,null,null,null,null,null,null,null,"KAZ","Kazakhstan","EUR","Up-Mid"]
[null,null,null,null,null,null,null,null,null,null,null,null,null,null,null,2.2000000000000002,"2.2 Dans quelle mesure le financement de la santé dans votre pays repose-t-il sur des sources de financement public/obligatoire (par exemple, fiscalité/recettes publiques, y compris les cotisations obligatoires à l’assurance-maladie nationale/sociale) ?\n",0,null,null,null,null,null,null,"Kazakhstan","KAZ",null,null,null,null,null,null,null,null,null,null,null,null,null,null,null,null,null,null,null,null,null,null,null,null,null,null,null,null,"KEN","Kenya","AFR","Low"]
[null,null,null,null,null,null,null,null,null,null,null,null,null,null,null,2.4,"2.4 Dans quelle mesure le flux de fonds publics est-il stable, Serait-ce grâce à une exécution régulière, c’est-à-dire un déblocage des fonds dans les délais, conformément aux budgets de santé approuvés ?",0,null,null,null,null,null,null,"Kenya","KEN",null,null,null,null,null,null,null,null,null,null,null,null,null,null,null,null,null,null,null,null,null,null,null,null,null,null,null,null,"KIR","Kiribati","WPR","Low-Mid"]
[null,null,null,null,null,null,null,null,null,null,null,null,null,null,null,2.5,"2.5 Dans quelle mesure les différentes sources de recettes sont-elles obtenues de façon progressive (c.-à-d. en fonction de la capacité de payer), et partant favorisent l’équité dans le mode de financement du système de santé ?",0,null,null,null,null,null,null,"Kiribati","KIR",null,null,null,null,null,null,null,null,null,null,null,null,null,null,null,null,null,null,null,null,null,null,null,null,null,null,null,null,"KWT","Kuwait","EMR","Hi"]
[null,null,null,null,null,null,null,null,null,null,null,null,null,null,null,3.4,"3.4 Y aurait-il des mesures, liées à la conception des prestations, au paiement des prestataires ou à des systèmes sous-jacents non financiers, qui ciblent les problèmes découlant de la fragmentation des caisses ?",0,null,null,null,null,null,null,"Kuwait","KWT",null,null,null,null,null,null,null,null,null,null,null,null,null,null,null,null,null,null,null,null,null,null,null,null,null,null,null,null,"KGZ","Kyrgyzstan","EUR","Low-Mid"]
[null,null,null,null,null,null,null,null,null,null,null,null,null,null,null,3.6,"3.6 Dans quelle mesure les dispositifs d’assurance-maladie volontaire sont-ils une source d’inégalités, créant des effets de contagion potentiellement néfastes pour l’ensemble du système de santé ?",0,null,null,null,null,null,null,"Kyrgyzstan","KGZ",null,null,null,null,null,null,null,null,null,null,null,null,null,null,null,null,null,null,null,null,null,null,null,null,null,null,null,null,"LAO","Lao People's Democratic Republic","WPR","Low-Mid"]
[null,null,null,null,null,null,null,null,null,null,null,null,null,null,null,4.1100000000000003,"4.10 Dans quelle mesure l’achat et le paiement des produits pharmaceutiques sont-ils mis en œuvre pour promouvoir l’utilisation efficace des médicaments (par ex. le recours aux génériques plutôt qu’aux princeps) et pour améliorer la protection financière des patients ?",0,null,null,null,null,null,null,"Lao People's Democratic Republic","LAO",null,null,null,null,null,null,null,null,null,null,null,null,null,null,null,null,null,null,null,null,null,null,null,null,null,null,null,null,"LVA","Latvia","EUR","Hi"]
[null,null,null,null,null,null,null,null,null,null,null,null,null,null,null,5.4,"5.4 Dans quelle mesure les prestations accordent-elles la priorité aux catégories de population prioritaires, par exemple pour une meilleure utilisation des services hautement prioritaires et la protection financière ?",0,null,null,null,null,null,null,"Latvia","LVA",null,null,null,null,null,null,null,null,null,null,null,null,null,null,null,null,null,null,null,null,null,null,null,null,null,null,null,null,"LBN","Lebanon","EMR","Up-Mid"]
[null,null,null,null,null,null,null,null,null,null,null,null,null,null,null,5.6,"5.6 Dans quelle mesure les prestations sont-elles alignées sur le paiement des prestataires, afin de s’assurer qu’elles sont fournies et que les patients bénéficient d’une protection financière ?",0,null,null,null,null,null,null,"Lebanon","LBN",null,null,null,null,null,null,null,null,null,null,null,null,null,null,null,null,null,null,null,null,null,null,null,null,null,null,null,null,"LSO","Lesotho","AFR","Low-Mid"]
[null,null,null,null,null,null,null,null,null,null,null,null,null,null,null,null,null,null,null,null,null,null,null,null,"Lesotho","LSO",null,null,null,null,null,null,null,null,null,null,null,null,null,null,null,null,null,null,null,null,null,null,null,null,null,null,null,null,"LBR","Liberia","AFR","Low"]
[null,null,null,null,null,null,null,null,null,null,null,null,null,null,null,"Protection financière ",null,null,null,null,null,null,null,null,"Liberia","LBR",null,null,null,null,null,null,null,null,null,null,null,null,null,null,null,null,null,null,null,null,null,null,null,null,null,null,null,null,"LBY","Libya","EMR","Up-Mid"]
[null,null,null,null,null,null,null,null,null,null,null,null,null,null,null,2.1,{"$f":"Q94","v":"2.1 Quelle approche en matière d’élaboration de politiques et de stratégies de collecte de recettes est en vigueur dans votre pays? Cette approche s'inscrit-elle dans le cadre d’un processus global d’élaboration et de planification de la mise en œuvre des politiques de financement de la santé ?"},{"$f":"IFERROR(VLOOKUP(P105,$A$8:$E$57,5,0),\"\")","v":0},null,null,null,null,null,null,"Libya","LBY",null,null,null,null,null,null,null,null,null,null,null,null,null,null,null,null,null,null,null,null,null,null,null,null,null,null,null,null,"LTU","Lithuania","EUR","Hi"]
[null,null,null,null,null,null,null,null,null,null,null,null,null,null,null,2.2000000000000002,{"$f":"Q95","v":"2.2 Dans quelle mesure le financement de la santé dans votre pays repose-t-il sur des sources de financement public/obligatoire (par exemple, fiscalité/recettes publiques, y compris les cotisations obligatoires à l’assurance-maladie nationale/sociale) ?\n"},0,null,null,null,null,null,null,"Lithuania","LTU",null,null,null,null,null,null,null,null,null,null,null,null,null,null,null,null,null,null,null,null,null,null,null,null,null,null,null,null,"LUX","Luxembourg","EUR","Hi"]
[null,null,null,null,null,null,null,null,null,null,null,null,null,null,null,2.4,{"$f":"Q96","v":"2.4 Dans quelle mesure le flux de fonds publics est-il stable, Serait-ce grâce à une exécution régulière, c’est-à-dire un déblocage des fonds dans les délais, conformément aux budgets de santé approuvés ?"},0,null,null,null,null,null,null,"Luxembourg","LUX",null,null,null,null,null,null,null,null,null,null,null,null,null,null,null,null,null,null,null,null,null,null,null,null,null,null,null,null,"MDG","Madagascar","AFR","Low"]
[null,null,null,null,null,null,null,null,null,null,null,null,null,null,null,2.5,{"$f":"Q97","v":"2.5 Dans quelle mesure les différentes sources de recettes sont-elles obtenues de façon progressive (c.-à-d. en fonction de la capacité de payer), et partant favorisent l’équité dans le mode de financement du système de santé ?"},0,null,null,null,null,null,null,"Madagascar","MDG",null,null,null,null,null,null,null,null,null,null,null,null,null,null,null,null,null,null,null,null,null,null,null,null,null,null,null,null,"MWI","Malawi","AFR","Low"]
[null,null,null,null,null,null,null,null,null,null,null,null,null,null,null,3.2,"3.2 Dans le cadre du processus global d’élaboration et de planification de la mise en œuvre des politiques de financement de la santé, quelle est l’approche de votre pays en matière de dispositifs de mise en commun des recettes ?",0,null,null,null,null,null,null,"Malawi","MWI",null,null,null,null,null,null,null,null,null,null,null,null,null,null,null,null,null,null,null,null,null,null,null,null,null,null,null,null,"MYS","Malaysia","WPR","Up-Mid"]
[null,null,null,null,null,null,null,null,null,null,null,null,null,null,null,3.3,"3.3 Dans quelle mesure la capacité de redistribution des fonds prépayés dans votre pays est-elle limitée par les accords institutionnels de financement de la santé ?",0,null,null,null,null,null,null,"Malaysia","MYS",null,null,null,null,null,null,null,null,null,null,null,null,null,null,null,null,null,null,null,null,null,null,null,null,null,null,null,null,"MDV","Maldives","SEAR","Up-Mid"]
[null,null,null,null,null,null,null,null,null,null,null,null,null,null,null,3.4,{"$f":"Q98","v":"3.4 Y aurait-il des mesures, liées à la conception des prestations, au paiement des prestataires ou à des systèmes sous-jacents non financiers, qui ciblent les problèmes découlant de la fragmentation des caisses ?"},0,null,null,null,null,null,null,"Maldives","MDV",null,null,null,null,null,null,null,null,null,null,null,null,null,null,null,null,null,null,null,null,null,null,null,null,null,null,null,null,"MLI","Mali","AFR","Low"]
[null,null,null,null,null,null,null,null,null,null,null,null,null,null,null,3.5,"3.5 Dans quelle mesure les différentes sources de recettes et de financement sont-elles organisées de manière complémentaire, afin de financer un paquet de prestations pour l’ensemble de la population ?",0,null,null,null,null,null,null,"Mali","MLI",null,null,null,null,null,null,null,null,null,null,null,null,null,null,null,null,null,null,null,null,null,null,null,null,null,null,null,null,"MLT","Malta","EUR","Hi"]
[null,null,null,null,null,null,null,null,null,null,null,null,null,null,null,3.6,{"$f":"Q99","v":"3.6 Dans quelle mesure les dispositifs d’assurance-maladie volontaire sont-ils une source d’inégalités, créant des effets de contagion potentiellement néfastes pour l’ensemble du système de santé ?"},0,null,null,null,null,null,null,"Malta","MLT",null,null,null,null,null,null,null,null,null,null,null,null,null,null,null,null,null,null,null,null,null,null,null,null,null,null,null,null,"MHL","Marshall Islands","WPR","Up-Mid"]
[null,null,null,null,null,null,null,null,null,null,null,null,null,null,null,4.1100000000000003,{"$f":"Q100","v":"4.10 Dans quelle mesure l’achat et le paiement des produits pharmaceutiques sont-ils mis en œuvre pour promouvoir l’utilisation efficace des médicaments (par ex. le recours aux génériques plutôt qu’aux princeps) et pour améliorer la protection financière des patients ?"},0,null,null,null,null,null,null,"Marshall Islands","MHL",null,null,null,null,null,null,null,null,null,null,null,null,null,null,null,null,null,null,null,null,null,null,null,null,null,null,null,null,"MRT","Mauritania","AFR","Low-Mid"]
[null,null,null,null,null,null,null,null,null,null,null,null,null,null,null,5.4,"5.4 Dans quelle mesure les prestations accordent-elles la priorité aux catégories de population prioritaires, par exemple pour une meilleure utilisation des services hautement prioritaires et la protection financière ?",0,null,null,null,null,null,null,"Mauritania","MRT",null,null,null,null,null,null,null,null,null,null,null,null,null,null,null,null,null,null,null,null,null,null,null,null,null,null,null,null,"MUS","Mauritius","AFR","Up-Mid"]
[null,null,null,null,null,null,null,null,null,null,null,null,null,null,null,5.6,"5.6 Dans quelle mesure les prestations sont-elles alignées sur le paiement des prestataires, afin de s’assurer qu’elles sont fournies et que les patients bénéficient d’une protection financière ?",0,null,null,null,null,null,null,"Mauritius","MUS",null,null,null,null,null,null,null,null,null,null,null,null,null,null,null,null,null,null,null,null,null,null,null,null,null,null,null,null,"MEX","Mexico","AMR","Up-Mid"]
[null,null,null,null,null,null,null,null,null,null,null,null,null,null,null,null,null,null,null,null,null,null,null,null,"Mexico","MEX",null,null,null,null,null,null,null,null,null,null,null,null,null,null,null,null,null,null,null,null,null,null,null,null,null,null,null,null,"FSM","Micronesia (Federated States of)","WPR","Low-Mid"]
[null,null,null,null,null,null,null,null,null,null,null,null,null,null,null,"Qualité",null,null,null,null,null,null,null,null,"Micronesia (Federated States of)","FSM",null,null,null,null,null,null,null,null,null,null,null,null,null,null,null,null,null,null,null,null,null,null,null,null,null,null,null,null,"MCO","Monaco","EUR","Hi"]
[null,null,null,null,null,null,null,null,null,null,null,null,null,null,null,4.2,"4.2 Dans quelle mesure les paiements des prestataires sont-ils harmonisés entre régimes/sources de recettes et entre secteurs public et privé, afin de garantir des incitations cohérentes aux prestataires ?",{"$f":"IFERROR(VLOOKUP(P119,$A$8:$E$57,5,0),\"\")","v":0},null,null,null,null,null,null,"Monaco","MCO",null,null,null,null,null,null,null,null,null,null,null,null,null,null,null,null,null,null,null,null,null,null,null,null,null,null,null,null,"MNG","Mongolia","WPR","Low-Mid"]
[null,null,null,null,null,null,null,null,null,null,null,null,null,null,null,4.3,"4.3 Dans quelle mesure les méthodes de paiement des prestataires et les achats en général favorisent-ils la qualité des soins et la coordination des soins entre les spécialités et les différents niveaux de soins ?",0,null,null,null,null,null,null,"Mongolia","MNG",null,null,null,null,null,null,null,null,null,null,null,null,null,null,null,null,null,null,null,null,null,null,null,null,null,null,null,null,"MNE","Montenegro","EUR","Up-Mid"]
[null,null,null,null,null,null,null,null,null,null,null,null,null,null,null,4.4000000000000004,"4.4 Dans quelle mesure les contrats d’achat précisent-ils des exigences en matière de qualité des soins, y compris la disponibilité et la pertinence des soins, puis vérifient-ils de façon régulière qu’elles sont bien respectées ?",0,null,null,null,null,null,null,"Montenegro","MNE",null,null,null,null,null,null,null,null,null,null,null,null,null,null,null,null,null,null,null,null,null,null,null,null,null,null,null,null,"MAR","Morocco","EMR","Low-Mid"]
[null,null,null,null,null,null,null,null,null,null,null,null,null,null,null,4.5999999999999996,"4.6 Dans quelle mesure les formulaires de demande standard, basés sur les formulaires de consultation avec le patient, sont-ils utilisés indépendamment de l’affiliation du patient au régime et utilisés pour examiner et évaluer les demandes ?",0,null,null,null,null,null,null,"Morocco","MAR",null,null,null,null,null,null,null,null,null,null,null,null,null,null,null,null,null,null,null,null,null,null,null,null,null,null,null,null,"MOZ","Mozambique","AFR","Low"]
[null,null,null,null,null,null,null,null,null,null,null,null,null,null,null,4.7,"4.7 Dans quelle mesure les paiements des prestataires ne couvrent-ils qu’une partie des coûts totaux, ou couvrent-ils les coûts totaux, y compris les salaires, les dépenses récurrentes, etc. ",0,null,null,null,null,null,null,"Mozambique","MOZ",null,null,null,null,null,null,null,null,null,null,null,null,null,null,null,null,null,null,null,null,null,null,null,null,null,null,null,null,"MMR","Myanmar","SEAR","Low"]
[null,null,null,null,null,null,null,null,null,null,null,null,null,null,null,4.8,"4.8 Dans quelle mesure les prestataires jouissent-ils d’une autonomie financière et sont-ils tenus responsables, dans une mesure réaliste et conforme à leurs capacités ?",0,null,null,null,null,null,null,"Myanmar","MMR",null,null,null,null,null,null,null,null,null,null,null,null,null,null,null,null,null,null,null,null,null,null,null,null,null,null,null,null,"NAM","Namibia","AFR","Up-Mid"]
[null,null,null,null,null,null,null,null,null,null,null,null,null,null,null,4.9000000000000004,"4.9 Dans quelle mesure l’accréditation des prestataires ou les contrats sélectifs sont-ils établis, fonctionnels et utilisés pour les achats ?",0,null,null,null,null,null,null,"Namibia","NAM",null,null,null,null,null,null,null,null,null,null,null,null,null,null,null,null,null,null,null,null,null,null,null,null,null,null,null,null,"NRU","Nauru","WPR","Up-Mid"]
[null,null,null,null,null,null,null,null,null,null,null,null,null,null,null,7.2,"7.2 Dans quelle mesure les institutions responsables du financement de la santé disposent-elles de capacités adéquates, notamment en matière de ressources humaines (capacités techniques et managériales) et de TIC ?",0,null,null,null,null,null,null,"Nauru","NRU",null,null,null,null,null,null,null,null,null,null,null,null,null,null,null,null,null,null,null,null,null,null,null,null,null,null,null,null,"NPL","Nepal","SEAR","Low"]
[null,null,null,null,null,null,null,null,null,null,null,null,null,null,null,null,null,null,null,null,null,null,null,null,"Nepal","NPL",null,null,null,null,null,null,null,null,null,null,null,null,null,null,null,null,null,null,null,null,null,null,null,null,null,null,null,null,"NLD","Netherlands","EUR","Hi"]
[null,null,null,null,null,null,null,null,null,null,null,null,null,null,null,"Utilisation par rapport aux besoins",null,null,null,null,null,null,null,null,"Netherlands","NLD",null,null,null,null,null,null,null,null,null,null,null,null,null,null,null,null,null,null,null,null,null,null,null,null,null,null,null,null,"NZL","New Zealand","WPR","Hi"]
[null,null,null,null,null,null,null,null,null,null,null,null,null,null,null,2.2999999999999998,{"$f":"Q77","v":"2.3 Dans quelle mesure le financement public de la santé dans votre pays est-il prévisible sur plusieurs années ?"},{"$f":"IFERROR(VLOOKUP(P129,$A$8:$E$57,5,0),\"\")","v":0},null,null,null,null,null,null,"New Zealand","NZL",null,null,null,null,null,null,null,null,null,null,null,null,null,null,null,null,null,null,null,null,null,null,null,null,null,null,null,null,"NIC","Nicaragua","AMR","Low-Mid"]
[null,null,null,null,null,null,null,null,null,null,null,null,null,null,null,2.4,{"$f":"Q107","v":"2.4 Dans quelle mesure le flux de fonds publics est-il stable, Serait-ce grâce à une exécution régulière, c’est-à-dire un déblocage des fonds dans les délais, conformément aux budgets de santé approuvés ?"},0,null,null,null,null,null,null,"Nicaragua","NIC",null,null,null,null,null,null,null,null,null,null,null,null,null,null,null,null,null,null,null,null,null,null,null,null,null,null,null,null,"NER","Niger","AFR","Low"]
[null,null,null,null,null,null,null,null,null,null,null,null,null,null,null,2.5,"2.5 Dans quelle mesure les différentes sources de recettes sont-elles obtenues de façon progressive (c.-à-d. en fonction de la capacité de payer), et partant favorisent l’équité dans le mode de financement du système de santé ?",0,null,null,null,null,null,null,"Niger","NER",null,null,null,null,null,null,null,null,null,null,null,null,null,null,null,null,null,null,null,null,null,null,null,null,null,null,null,null,"NGA","Nigeria","AFR","Low-Mid"]
[null,null,null,null,null,null,null,null,null,null,null,null,null,null,null,3.2,"3.2 Dans le cadre du processus global d’élaboration et de planification de la mise en œuvre des politiques de financement de la santé, quelle est l’approche de votre pays en matière de dispositifs de mise en commun des recettes ?",0,null,null,null,null,null,null,"Nigeria","NGA",null,null,null,null,null,null,null,null,null,null,null,null,null,null,null,null,null,null,null,null,null,null,null,null,null,null,null,null,"NIU","Niue","WPR","Up-Mid"]
[null,null,null,null,null,null,null,null,null,null,null,null,null,null,null,3.3,"3.3 Dans quelle mesure la capacité de redistribution des fonds prépayés dans votre pays est-elle limitée par les accords institutionnels de financement de la santé ?",0,null,null,null,null,null,null,"Niue","NIU",null,null,null,null,null,null,null,null,null,null,null,null,null,null,null,null,null,null,null,null,null,null,null,null,null,null,null,null,"NOR","Norway","EUR","Hi"]
[null,null,null,null,null,null,null,null,null,null,null,null,null,null,null,3.4,"3.4 Y aurait-il des mesures, liées à la conception des prestations, au paiement des prestataires ou à des systèmes sous-jacents non financiers, qui ciblent les problèmes découlant de la fragmentation des caisses ?",0,null,null,null,null,null,null,"Norway","NOR",null,null,null,null,null,null,null,null,null,null,null,null,null,null,null,null,null,null,null,null,null,null,null,null,null,null,null,null,"OMN","Oman","EMR","Hi"]
[null,null,null,null,null,null,null,null,null,null,null,null,null,null,null,3.5,"3.5 Dans quelle mesure les différentes sources de recettes et de financement sont-elles organisées de manière complémentaire, afin de financer un paquet de prestations pour l’ensemble de la population ?",0,null,null,null,null,null,null,"Oman","OMN",null,null,null,null,null,null,null,null,null,null,null,null,null,null,null,null,null,null,null,null,null,null,null,null,null,null,null,null,"PAK","Pakistan","EMR","Low-Mid"]
[null,null,null,null,null,null,null,null,null,null,null,null,null,null,null,4.0999999999999996,"4.1 Dans quelle mesure les allocations de fonds aux acheteurs de niveau inférieur, par exemple les administrations locales, et/ou les taux de paiement aux prestataires sont-ils le reflet des besoins de santé de la population ?",0,null,null,null,null,null,null,"Pakistan","PAK",null,null,null,null,null,null,null,null,null,null,null,null,null,null,null,null,null,null,null,null,null,null,null,null,null,null,null,null,"PLW","Palau","WPR","Up-Mid"]
[null,null,null,null,null,null,null,null,null,null,null,null,null,null,null,5.3,"5.3 Dans quelle mesure les droits à prestation reflètent-ils explicitement les besoins de santé de la population ?",0,null,null,null,null,null,null,"Palau","PLW",null,null,null,null,null,null,null,null,null,null,null,null,null,null,null,null,null,null,null,null,null,null,null,null,null,null,null,null,"PAN","Panama","AMR","Up-Mid"]
[null,null,null,null,null,null,null,null,null,null,null,null,null,null,null,5.4,"5.4 Dans quelle mesure les prestations accordent-elles la priorité aux catégories de population prioritaires, par exemple pour une meilleure utilisation des services hautement prioritaires et la protection financière ?",0,null,null,null,null,null,null,"Panama","PAN",null,null,null,null,null,null,null,null,null,null,null,null,null,null,null,null,null,null,null,null,null,null,null,null,null,null,null,null,"PNG","Papua New Guinea","WPR","Low-Mid"]
[null,null,null,null,null,null,null,null,null,null,null,null,null,null,null,5.5,"5.5 Dans quelle mesure les droits et obligations de la population sont-ils explicitement définis et compris par les intéressés ?",0,null,null,null,null,null,null,"Papua New Guinea","PNG",null,null,null,null,null,null,null,null,null,null,null,null,null,null,null,null,null,null,null,null,null,null,null,null,null,null,null,null,"PRY","Paraguay","AMR","Low-Mid"]
[null,null,null,null,null,null,null,null,null,null,null,null,null,null,null,5.6,"5.6 Dans quelle mesure les prestations sont-elles alignées sur le paiement des prestataires, afin de s’assurer qu’elles sont fournies et que les patients bénéficient d’une protection financière ?",0,null,null,null,null,null,null,"Paraguay","PRY",null,null,null,null,null,null,null,null,null,null,null,null,null,null,null,null,null,null,null,null,null,null,null,null,null,null,null,null,"PER","Peru","AMR","Up-Mid"]
[null,null,null,null,null,null,null,null,null,null,null,null,null,null,null,5.7,"5.7 Dans quelle mesure les prestations, y compris le partage des coûts pour les patients, sont-elles alignées sur les recettes, afin d’assurer un financement adéquat des droits à prestations approuvés ?",0,null,null,null,null,null,null,"Peru","PER",null,null,null,null,null,null,null,null,null,null,null,null,null,null,null,null,null,null,null,null,null,null,null,null,null,null,null,null,"PHL","Philippines","WPR","Low-Mid"]
[null,null,null,null,null,null,null,null,null,null,null,null,null,null,null,6.4,"6.4 Mesure dans laquelle les allocations budgétaires annuelles en matière de santé sont alignées sur les priorités du secteur de la santé (niveau, structure, nature/objectif)",0,null,null,null,null,null,null,"Philippines","PHL",null,null,null,null,null,null,null,null,null,null,null,null,null,null,null,null,null,null,null,null,null,null,null,null,null,null,null,null,"POL","Poland","EUR","Hi"]
[null,null,null,null,null,null,null,null,null,null,null,null,null,null,null,6.6,"6.6 Dans quelle mesure les transferts fiscaux sont conçus et mis en œuvre de sorte à améliorer l’équité de la distribution des ressources dans le secteur de la santé?",0,null,null,null,null,null,null,"Poland","POL",null,null,null,null,null,null,null,null,null,null,null,null,null,null,null,null,null,null,null,null,null,null,null,null,null,null,null,null,"PRT","Portugal","EUR","Hi"]
[null,null,null,null,null,null,null,null,null,null,null,null,null,null,null,6.7,"6.7 Dans quelle mesure les règles du budget de la santé permettent-elles une certaine souplesse des dépenses? ",0,null,null,null,null,null,null,"Portugal","PRT",null,null,null,null,null,null,null,null,null,null,null,null,null,null,null,null,null,null,null,null,null,null,null,null,null,null,null,null,"QAT","Qatar","EMR","Hi"]
[null,null,null,null,null,null,null,null,null,null,null,null,null,null,null,6.15,"6.11 Dans quelle mesure les flux financiers multiples, la structure budgétaire et les règles de GFP sont alignés sur les politiques d’achats stratégiques?",0,null,null,null,null,null,null,"Qatar","QAT",null,null,null,null,null,null,null,null,null,null,null,null,null,null,null,null,null,null,null,null,null,null,null,null,null,null,null,null,"KOR","Republic of Korea","WPR","Hi"]
[null,null,null,null,null,null,null,null,null,null,null,null,null,null,null,null,null,null,null,null,null,null,null,null,"Republic of Korea","KOR",null,null,null,null,null,null,null,null,null,null,null,null,null,null,null,null,null,null,null,null,null,null,null,null,null,null,null,null,"MDA","Republic of Moldova","EUR","Low-Mid"]
[null,null,null,null,null,null,null,null,null,null,null,null,null,null,null,null,null,null,null,null,null,null,null,null,"Republic of Moldova","MDA",null,null,null,null,null,null,null,null,null,null,null,null,null,null,null,null,null,null,null,null,null,null,null,null,null,null,null,null,"ROU","Romania","EUR","Up-Mid"]
[null,null,null,null,null,null,null,null,null,null,null,null,null,null,null,null,null,null,null,null,null,null,null,null,"Romania","ROU",null,null,null,null,null,null,null,null,null,null,null,null,null,null,null,null,null,null,null,null,null,null,null,null,null,null,null,null,"RUS","Russian Federation","EUR","Hi"]
[null,null,null,null,null,null,null,null,null,null,null,null,null,null,null,null,null,null,null,null,null,null,null,null,"Russian Federation","RUS",null,null,null,null,null,null,null,null,null,null,null,null,null,null,null,null,null,null,null,null,null,null,null,null,null,null,null,null,"RWA","Rwanda","AFR","Low"]
[null,null,null,null,null,null,null,null,null,null,null,null,null,null,null,null,null,null,null,null,null,null,null,null,"Rwanda","RWA",null,null,null,null,null,null,null,null,null,null,null,null,null,null,null,null,null,null,null,null,null,null,null,null,null,null,null,null,"KNA","Saint Kitts and Nevis","AMR","Hi"]
[null,null,null,null,null,null,null,null,null,null,null,null,null,null,null,null,null,null,null,null,null,null,null,null,"Saint Kitts and Nevis","KNA",null,null,null,null,null,null,null,null,null,null,null,null,null,null,null,null,null,null,null,null,null,null,null,null,null,null,null,null,"LCA","Saint Lucia","AMR","Up-Mid"]
[null,null,null,null,null,null,null,null,null,null,null,null,null,null,null,null,null,null,null,null,null,null,null,null,"Saint Lucia","LCA",null,null,null,null,null,null,null,null,null,null,null,null,null,null,null,null,null,null,null,null,null,null,null,null,null,null,null,null,"VCT","Saint Vincent and the Grenadines","AMR","Up-Mid"]
[null,null,null,null,null,null,null,null,null,null,null,null,null,null,null,null,null,null,null,null,null,null,null,null,"Saint Vincent and the Grenadines","VCT",null,null,null,null,null,null,null,null,null,null,null,null,null,null,null,null,null,null,null,null,null,null,null,null,null,null,null,null,"WSM","Samoa","WPR","Low-Mid"]
[null,null,null,null,null,null,null,null,null,null,null,null,null,null,null,null,null,null,null,null,null,null,null,null,"Samoa","WSM",null,null,null,null,null,null,null,null,null,null,null,null,null,null,null,null,null,null,null,null,null,null,null,null,null,null,null,null,"SMR","San Marino","EUR","Hi"]
[null,null,null,null,null,null,null,null,null,null,null,null,null,null,null,null,null,null,null,null,null,null,null,null,"San Marino","SMR",null,null,null,null,null,null,null,null,null,null,null,null,null,null,null,null,null,null,null,null,null,null,null,null,null,null,null,null,"STP","Sao Tome and Principe","AFR","Low-Mid"]
[null,null,null,null,null,null,null,null,null,null,null,null,null,null,null,null,null,null,null,null,null,null,null,null,"Sao Tome and Principe","STP",null,null,null,null,null,null,null,null,null,null,null,null,null,null,null,null,null,null,null,null,null,null,null,null,null,null,null,null,"SAU","Saudi Arabia","EMR","Hi"]
[null,null,null,null,null,null,null,null,null,null,null,null,null,null,null,null,null,null,null,null,null,null,null,null,"Saudi Arabia","SAU",null,null,null,null,null,null,null,null,null,null,null,null,null,null,null,null,null,null,null,null,null,null,null,null,null,null,null,null,"SEN","Senegal","AFR","Low-Mid"]
[null,null,null,null,null,null,null,null,null,null,null,null,null,null,null,null,null,null,null,null,null,null,null,null,"Senegal","SEN",null,null,null,null,null,null,null,null,null,null,null,null,null,null,null,null,null,null,null,null,null,null,null,null,null,null,null,null,"SRB","Serbia","EUR","Up-Mid"]
[null,null,null,null,null,null,null,null,null,null,null,null,null,null,null,null,null,null,null,null,null,null,null,null,"Serbia","SRB",null,null,null,null,null,null,null,null,null,null,null,null,null,null,null,null,null,null,null,null,null,null,null,null,null,null,null,null,"SYC","Seychelles","AFR","Up-Mid"]
[null,null,null,null,null,null,null,null,null,null,null,null,null,null,null,null,null,null,null,null,null,null,null,null,"Seychelles","SYC",null,null,null,null,null,null,null,null,null,null,null,null,null,null,null,null,null,null,null,null,null,null,null,null,null,null,null,null,"SLE","Sierra Leone","AFR","Low"]
[null,null,null,null,null,null,null,null,null,null,null,null,null,null,null,null,null,null,null,null,null,null,null,null,"Sierra Leone","SLE",null,null,null,null,null,null,null,null,null,null,null,null,null,null,null,null,null,null,null,null,null,null,null,null,null,null,null,null,"SGP","Singapore","WPR","Hi"]
[null,null,null,null,null,null,null,null,null,null,null,null,null,null,null,null,null,null,null,null,null,null,null,null,"Singapore","SGP",null,null,null,null,null,null,null,null,null,null,null,null,null,null,null,null,null,null,null,null,null,null,null,null,null,null,null,null,"SVK","Slovakia","EUR","Hi"]
[null,null,null,null,null,null,null,null,null,null,null,null,null,null,null,null,null,null,null,null,null,null,null,null,"Slovakia","SVK",null,null,null,null,null,null,null,null,null,null,null,null,null,null,null,null,null,null,null,null,null,null,null,null,null,null,null,null,"SVN","Slovenia","EUR","Hi"]
[null,null,null,null,null,null,null,null,null,null,null,null,null,null,null,null,null,null,null,null,null,null,null,null,"Slovenia","SVN",null,null,null,null,null,null,null,null,null,null,null,null,null,null,null,null,null,null,null,null,null,null,null,null,null,null,null,null,"SLB","Solomon Islands","WPR","Low-Mid"]
[null,null,null,null,null,null,null,null,null,null,null,null,null,null,null,null,null,null,null,null,null,null,null,null,"Solomon Islands","SLB",null,null,null,null,null,null,null,null,null,null,null,null,null,null,null,null,null,null,null,null,null,null,null,null,null,null,null,null,"SOM","Somalia","EMR","Low"]
[null,null,null,null,null,null,null,null,null,null,null,null,null,null,null,null,null,null,null,null,null,null,null,null,"Somalia","SOM",null,null,null,null,null,null,null,null,null,null,null,null,null,null,null,null,null,null,null,null,null,null,null,null,null,null,null,null,"ZAF","South Africa","AFR","Up-Mid"]
[null,null,null,null,null,null,null,null,null,null,null,null,null,null,null,null,null,null,null,null,null,null,null,null,"South Africa","ZAF",null,null,null,null,null,null,null,null,null,null,null,null,null,null,null,null,null,null,null,null,null,null,null,null,null,null,null,null,"SSD","South Sudan","AFR","Low-Mid"]
[null,null,null,null,null,null,null,null,null,null,null,null,null,null,null,null,null,null,null,null,null,null,null,null,"South Sudan","SSD",null,null,null,null,null,null,null,null,null,null,null,null,null,null,null,null,null,null,null,null,null,null,null,null,null,null,null,null,"ESP","Spain","EUR","Hi"]
[null,null,null,null,null,null,null,null,null,null,null,null,null,null,null,null,null,null,null,null,null,null,null,null,"Spain","ESP",null,null,null,null,null,null,null,null,null,null,null,null,null,null,null,null,null,null,null,null,null,null,null,null,null,null,null,null,"LKA","Sri Lanka","SEAR","Low-Mid"]
[null,null,null,null,null,null,null,null,null,null,null,null,null,null,null,null,null,null,null,null,null,null,null,null,"Sri Lanka","LKA",null,null,null,null,null,null,null,null,null,null,null,null,null,null,null,null,null,null,null,null,null,null,null,null,null,null,null,null,"SDN","Sudan","EMR","Low-Mid"]
[null,null,null,null,null,null,null,null,null,null,null,null,null,null,null,null,null,null,null,null,null,null,null,null,"Sudan","SDN",null,null,null,null,null,null,null,null,null,null,null,null,null,null,null,null,null,null,null,null,null,null,null,null,null,null,null,null,"SUR","Suriname","AMR","Up-Mid"]
[null,null,null,null,null,null,null,null,null,null,null,null,null,null,null,null,null,null,null,null,null,null,null,null,"Suriname","SUR",null,null,null,null,null,null,null,null,null,null,null,null,null,null,null,null,null,null,null,null,null,null,null,null,null,null,null,null,"SWZ","Swaziland","AFR","Low-Mid"]
[null,null,null,null,null,null,null,null,null,null,null,null,null,null,null,null,null,null,null,null,null,null,null,null,"Swaziland","SWZ",null,null,null,null,null,null,null,null,null,null,null,null,null,null,null,null,null,null,null,null,null,null,null,null,null,null,null,null,"SWE","Sweden","EUR","Hi"]
[null,null,null,null,null,null,null,null,null,null,null,null,null,null,null,null,null,null,null,null,null,null,null,null,"Sweden","SWE",null,null,null,null,null,null,null,null,null,null,null,null,null,null,null,null,null,null,null,null,null,null,null,null,null,null,null,null,"CHE","Switzerland","EUR","Hi"]
[null,null,null,null,null,null,null,null,null,null,null,null,null,null,null,null,null,null,null,null,null,null,null,null,"Switzerland","CHE",null,null,null,null,null,null,null,null,null,null,null,null,null,null,null,null,null,null,null,null,null,null,null,null,null,null,null,null,"SYR","Syrian Arab Republic","EMR","Low-Mid"]
[null,null,null,null,null,null,null,null,null,null,null,null,null,null,null,null,null,null,null,null,null,null,null,null,"Syrian Arab Republic","SYR",null,null,null,null,null,null,null,null,null,null,null,null,null,null,null,null,null,null,null,null,null,null,null,null,null,null,null,null,"TJK","Tajikistan","EUR","Low"]
[null,null,null,null,null,null,null,null,null,null,null,null,null,null,null,null,null,null,null,null,null,null,null,null,"Tajikistan","TJK",null,null,null,null,null,null,null,null,null,null,null,null,null,null,null,null,null,null,null,null,null,null,null,null,null,null,null,null,"THA","Thailand","SEAR","Up-Mid"]
[null,null,null,null,null,null,null,null,null,null,null,null,null,null,null,null,null,null,null,null,null,null,null,null,"Thailand","THA",null,null,null,null,null,null,null,null,null,null,null,null,null,null,null,null,null,null,null,null,null,null,null,null,null,null,null,null,"MKD","The former Yugoslav Republic of Macedonia","EUR","Up-Mid"]
[null,null,null,null,null,null,null,null,null,null,null,null,null,null,null,null,null,null,null,null,null,null,null,null,"The former Yugoslav Republic of Macedonia","MKD",null,null,null,null,null,null,null,null,null,null,null,null,null,null,null,null,null,null,null,null,null,null,null,null,null,null,null,null,"TLS","Timor-Leste","SEAR","Low-Mid"]
[null,null,null,null,null,null,null,null,null,null,null,null,null,null,null,null,null,null,null,null,null,null,null,null,"Timor-Leste","TLS",null,null,null,null,null,null,null,null,null,null,null,null,null,null,null,null,null,null,null,null,null,null,null,null,null,null,null,null,"TGO","Togo","AFR","Low"]
[null,null,null,null,null,null,null,null,null,null,null,null,null,null,null,null,null,null,null,null,null,null,null,null,"Togo","TGO",null,null,null,null,null,null,null,null,null,null,null,null,null,null,null,null,null,null,null,null,null,null,null,null,null,null,null,null,"TON","Tonga","WPR","Up-Mid"]
[null,null,null,null,null,null,null,null,null,null,null,null,null,null,null,null,null,null,null,null,null,null,null,null,"Tonga","TON",null,null,null,null,null,null,null,null,null,null,null,null,null,null,null,null,null,null,null,null,null,null,null,null,null,null,null,null,"TTO","Trinidad and Tobago","AMR","Hi"]
[null,null,null,null,null,null,null,null,null,null,null,null,null,null,null,null,null,null,null,null,null,null,null,null,"Trinidad and Tobago","TTO",null,null,null,null,null,null,null,null,null,null,null,null,null,null,null,null,null,null,null,null,null,null,null,null,null,null,null,null,"TUN","Tunisia","EMR","Up-Mid"]
[null,null,null,null,null,null,null,null,null,null,null,null,null,null,null,null,null,null,null,null,null,null,null,null,"Tunisia","TUN",null,null,null,null,null,null,null,null,null,null,null,null,null,null,null,null,null,null,null,null,null,null,null,null,null,null,null,null,"TUR","Turkey","EUR","Up-Mid"]
[null,null,null,null,null,null,null,null,null,null,null,null,null,null,null,null,null,null,null,null,null,null,null,null,"Turkey","TUR",null,null,null,null,null,null,null,null,null,null,null,null,null,null,null,null,null,null,null,null,null,null,null,null,null,null,null,null,"TKM","Turkmenistan","EUR","Up-Mid"]
[null,null,null,null,null,null,null,null,null,null,null,null,null,null,null,null,null,null,null,null,null,null,null,null,"Turkmenistan","TKM",null,null,null,null,null,null,null,null,null,null,null,null,null,null,null,null,null,null,null,null,null,null,null,null,null,null,null,null,"TUV","Tuvalu","WPR","Up-Mid"]
[null,null,null,null,null,null,null,null,null,null,null,null,null,null,null,null,null,null,null,null,null,null,null,null,"Tuvalu","TUV",null,null,null,null,null,null,null,null,null,null,null,null,null,null,null,null,null,null,null,null,null,null,null,null,null,null,null,null,"UGA","Uganda","AFR","Low"]
[null,null,null,null,null,null,null,null,null,null,null,null,null,null,null,null,null,null,null,null,null,null,null,null,"Uganda","UGA",null,null,null,null,null,null,null,null,null,null,null,null,null,null,null,null,null,null,null,null,null,null,null,null,null,null,null,null,"UKR","Ukraine","EUR","Low-Mid"]
[null,null,null,null,null,null,null,null,null,null,null,null,null,null,null,null,null,null,null,null,null,null,null,null,"Ukraine","UKR",null,null,null,null,null,null,null,null,null,null,null,null,null,null,null,null,null,null,null,null,null,null,null,null,null,null,null,null,"ARE","United Arab Emirates","EMR","Hi"]
[null,null,null,null,null,null,null,null,null,null,null,null,null,null,null,null,null,null,null,null,null,null,null,null,"United Arab Emirates","ARE",null,null,null,null,null,null,null,null,null,null,null,null,null,null,null,null,null,null,null,null,null,null,null,null,null,null,null,null,"GBR","United Kingdom","EUR","Hi"]
[null,null,null,null,null,null,null,null,null,null,null,null,null,null,null,null,null,null,null,null,null,null,null,null,"United Kingdom","GBR",null,null,null,null,null,null,null,null,null,null,null,null,null,null,null,null,null,null,null,null,null,null,null,null,null,null,null,null,"TZA","United Republic of Tanzania","AFR","Low"]
[null,null,null,null,null,null,null,null,null,null,null,null,null,null,null,null,null,null,null,null,null,null,null,null,"United Republic of Tanzania","TZA",null,null,null,null,null,null,null,null,null,null,null,null,null,null,null,null,null,null,null,null,null,null,null,null,null,null,null,null,"USA","United States of America","AMR","Hi"]
[null,null,null,null,null,null,null,null,null,null,null,null,null,null,null,null,null,null,null,null,null,null,null,null,"United States of America","USA",null,null,null,null,null,null,null,null,null,null,null,null,null,null,null,null,null,null,null,null,null,null,null,null,null,null,null,null,"URY","Uruguay","AMR","Hi"]
[null,null,null,null,null,null,null,null,null,null,null,null,null,null,null,null,null,null,null,null,null,null,null,null,"Uruguay","URY",null,null,null,null,null,null,null,null,null,null,null,null,null,null,null,null,null,null,null,null,null,null,null,null,null,null,null,null,"UZB","Uzbekistan","EUR","Low-Mid"]
[null,null,null,null,null,null,null,null,null,null,null,null,null,null,null,null,null,null,null,null,null,null,null,null,"Uzbekistan","UZB",null,null,null,null,null,null,null,null,null,null,null,null,null,null,null,null,null,null,null,null,null,null,null,null,null,null,null,null,"VUT","Vanuatu","WPR","Low-Mid"]
[null,null,null,null,null,null,null,null,null,null,null,null,null,null,null,null,null,null,null,null,null,null,null,null,"Vanuatu","VUT",null,null,null,null,null,null,null,null,null,null,null,null,null,null,null,null,null,null,null,null,null,null,null,null,null,null,null,null,"VEN","Venezuela (Bolivarian Republic of)","AMR","Up-Mid"]
[null,null,null,null,null,null,null,null,null,null,null,null,null,null,null,null,null,null,null,null,null,null,null,null,"Venezuela (Bolivarian Republic of)","VEN",null,null,null,null,null,null,null,null,null,null,null,null,null,null,null,null,null,null,null,null,null,null,null,null,null,null,null,null,"VNM","Viet Nam","WPR","Low-Mid"]
[null,null,null,null,null,null,null,null,null,null,null,null,null,null,null,null,null,null,null,null,null,null,null,null,"Viet Nam","VNM",null,null,null,null,null,null,null,null,null,null,null,null,null,null,null,null,null,null,null,null,null,null,null,null,null,null,null,null,"YEM","Yemen","EMR","Low-Mid"]
[null,null,null,null,null,null,null,null,null,null,null,null,null,null,null,null,null,null,null,null,null,null,null,null,"Yemen","YEM",null,null,null,null,null,null,null,null,null,null,null,null,null,null,null,null,null,null,null,null,null,null,null,null,null,null,null,null,"ZMB","Zambia","AFR","Low-Mid"]
[null,null,null,null,null,null,null,null,null,null,null,null,null,null,null,null,null,null,null,null,null,null,null,null,"Zambia","ZMB",null,null,null,null,null,null,null,null,null,null,null,null,null,null,null,null,null,null,null,null,null,null,null,null,null,null,null,null,"ZWE","Zimbabwe","AFR","Low"]
[null,null,null,null,null,null,null,null,null,null,null,null,null,null,null,null,null,null,null,null,null,null,null,null,"Zimbabwe","ZWE"]

{"sheet":"Print Excel","index":3,"n_rows":678,"n_cols":2,"rows_kept":678,"cut":false,"hidden":true,"merged":[[123,1,128,1],[10,1,17,1],[21,1,29,1],[58,1,67,1],[70,1,94,1]]}
[1]
[]
[]
[]
[]
[]
[]
[]
[]
[]
[null,{"$f":"Instructions!H19","v":0}]
[]
[]
[]
[]
[]
[]
[]
[]
[]
[]
[null,"MATRICE DE PROGRÈS POUR LE FINANCEMENT DE LA SANTÉ"]
[]
[]
[]
[]
[]
[]
[]
[]
[]
[]
[]
[]
[]
[]
[]
[]
[]
[]
[]
[]
[]
[]
[]
[]
[]
[]
[null,{"$f":"'Print your results Full'!D20","v":"Période couverte :"}]
[]
[null,{"$f":"Results!E5","v":"0 -0"}]
[]
[]
[]
[]
[]
[]
[null,{"$f":"Instructions!G21","v":"Rempli par :"}]
[null,{"$f":"Instructions!H21","v":0}]
[]
[]
[]
[]
[]
[]
[]
[]
[]
[]
[null,{"$f":"Results!C6","v":"Processus suivi:"}]
[null,{"$f":"Results!D6","v":0}]
[]
[]
[]
[]
[]
[]
[]
[]
[]
[]
[]
[]
[]
[]
[]
[]
[]
[]
[]
[]
[]
[]
[]
[]
[]
[]
[]
[]
[]
[]
[]
[]
[]
[]
[]
[]
[]
[]
[]
[]
[]
[]
[]
[]
[]
[]
[]
[]
[]
[]
[]
[]
[null,"Nous tenons à remercier tous ceux qui ont contribué à l’élaboration des matrices de progrès dans le cadre d’une réunion d’examen qui s’est tenue à Genève en mai 2018. Ce travail a bénéficié du soutien financier de la République de Corée du Sud et du Royaume-Uni (don du DfID MCHSS), que nous tenons également à remercier vivement."]
[]
[]
[]
[]
[]
[]
[]
[]
[]
[]
[]
[]
[]
[]
[]
[]
[]
[]
[]
[]
[]
[]
[]
[]
[]
[null,{"$f":"Results!K8","v":"Processus d’élaboration des politiques"}]
[]
[]
[]
[]
[]
[]
[]
[]
[]
[]
[]
[]
[]
[]
[]
[]
[]
[null,{"$f":"IF(criteria1=0,\"\",Results!E63)","v":""}]
[]
[null,{"$f":"IF(criteria1=0,\"\",Results!A63)","v":""}]
[]
[]
[null,{"$f":"'Policy Development Process'!D8","v":"Q1.1 Le système de financement de la santé de votre pays a-t-il récemment fait l’objet d’un diagnostic ou d’une évaluation approfondie qui examine son impact sur les performances du système de santé ainsi que les causes des problèmes de performance ?\n\n"}]
[null,{"$f":"\"Scale = \"&Q1.1& \"/12\"","v":"Scale = 0/12"}]
[]
[null,{"$f":"Results!F8","v":""}]
[]
[null,{"$f":"'Policy Development Process'!D24","v":"Q1.2 A-t-on transposé en textes de loi/décrets une déclaration de politique récente relative au financement de la santé ?"}]
[null,{"$f":"\"Scale = \"&Q1.2& \"/12\"","v":"Scale = 0/12"}]
[]
[null,{"$f":"Results!F9","v":""}]
[]
[null,{"$f":"'Policy Development Process'!D40","v":"Q1.3 Existe-t-il un système de suivi régulier du financement de la santé, et si oui les données sont-elles utilisées pour suivre les progrès effectués (par exemple sur les modèles de dépenses et la protection financière) et pour renforcer la reddition de comptes ?\n"}]
[null,{"$f":"\"Scale = \"&Q1.3& \"/12\"","v":"Scale = 0/12"}]
[]
[null,{"$f":"Results!F10","v":""}]
[]
[null,{"$f":"'Policy Development Process'!D57","v":"Q1.4 Les études d’évaluation sont-elles réalisées sur une base systématique pour mesurer les conséquences de la mise en œuvre de réformes spécifiques du financement sur les objectifs du système de santé et dans quelles mesure les résultats servent-ils à guider la conception et la révision des politiques de financement de la santé ?\n"}]
[null,{"$f":"\"Scale = \"&Q1.4& \"/12\"","v":"Scale = 0/12"}]
[]
[null,{"$f":"Results!F11","v":""}]
[]
[]
[null,"Résumez ici les prochaines étapes, priorités ou points d’action que vous avez identifiés après avoir complété cette matrice relative aux Prestations et droits."]
[null,{"$f":"Results!M8","v":""}]
[]
[null,{"$f":"Results!K9","v":"Collecte de recettes"}]
[]
[]
[]
[]
[]
[]
[]
[]
[]
[]
[]
[]
[null,{"$f":"IF(criteria1=0,\"\",Results!E103)","v":""}]
[]
[null,{"$f":"IF(criteria1=0,\"\",Results!A103)","v":""}]
[]
[]
[]
[]
[]
[null,{"$f":"'Revenue Raising'!D8","v":"Q2.1 Quelle approche est en vigueur dans votre pays en matière d’élaboration de politiques et de stratégies de collecte de revenus ? Cette approche s'inscrit-elle dans le cadre du processus global d’élaboration et de planification de la mise en œuvre des politiques de financement de la santé ?\n"}]
[null,{"$f":"\"Scale = \"&Q2.1& \"/12\"","v":"Scale = 0/12"}]
[]
[null,{"$f":"Results!F12","v":""}]
[]
[null,{"$f":"'Revenue Raising'!D24","v":"Q2.2 Dans quelle mesure le financement de la santé dans votre pays repose-t-il sur des sources de financement public/obligatoire (par exemple, fiscalité/recettes publiques, y compris les cotisations obligatoires à l’assurance-maladie nationale/sociale) ?\n"}]
[null,{"$f":"\"Scale = \"&Q2.2& \"/12\"","v":"Scale = 0/12"}]
[]
[null,{"$f":"Results!F13","v":""}]
[]
[null,{"$f":"'Revenue Raising'!D40","v":"Q2.3 Dans quelle mesure le financement public de la santé dans votre pays est-il prédictible sur plusieurs années ?\n"}]
[null,{"$f":"\"Scale = \"&Q2.3& \"/12\"","v":"Scale = 0/12"}]
[]
[null,{"$f":"Results!F14","v":""}]
[]
[null,{"$f":"'Revenue Raising'!D56","v":"Q2.4 Dans quelle mesure le flux de fonds publics est-il stable, notamment grâce à une exécution budgétaire régulière, c’est-à-dire un déblocage des fonds dans les délais, conformément aux budgets de santé approuvés ?\n"}]
[null,{"$f":"\"Scale = \"&Q2.4& \"/12\"","v":"Scale = 0/12"}]
[]
[null,{"$f":"Results!F15","v":""}]
[]
[null,{"$f":"'Revenue Raising'!D72","v":"Q2.5 Dans quelle mesure les différentes sources de revenus sont-elles collectées de façon progressive (c.-à-d. en fonction de la capacité de payer), et partant de là favorisent l’équité dans le mode de financement du système de santé ?\n"}]
[null,{"$f":"\"Scale = \"&Q2.5& \"/12\"","v":"Scale = 0/12"}]
[]
[null,{"$f":"Results!F16","v":""}]
[]
[]
[null,"Résumez ici les prochaines étapes, priorités ou points d’action que vous avez identifiés après avoir complété cette matrice relative aux Prestations et droits."]
[null,{"$f":"Results!M9","v":""}]
[]
[]
[null,"Further resources"]
[]
[]
[null,"Revenue raising matrix – additional resources:"]
[null,"· WHO webpage on “Revenue raising for health” (link)"]
[null,"· Module 2 of WHO e-learning course on health financing policy for UHC (register here)"]
[null,"· McIntyre D, Kutzin J. (2016). “Health financing country diagnostic: a foundation for national strategy development”. WHO Geneva (link) (see relevant sections on revenue raising)"]
[null,"· Kutzin J, Witter S, Jowett M, Bayarsaikhan D. (2017) “Developing a National Health Financing Strategy: A Reference Guide”. Health Financing Guidance No3. WHO, Geneva (link) (see relevant sections on revenue raising)"]
[]
[null,"References for revenue raising:"]
[null,"· Jowett M and Kutzin J, (2015). “Raising revenues for health in support of UHC: strategic issues for policy makers” Health Financing Policy Brief No. 1. WHO, Geneva (link)"]
[null,"· World Health Organization (2018) “New Perspectives on Global Health Spending for Universal Health Coverage”. Health Financing Working Paper No. 10. WHO, Geneva (link)"]
[null,"· Cashin C., Sparkes S., Bloom D. (2017). “Earmarking for health: from theory to practice”. Health Financing Working Paper No. 5. WHO, Geneva (link)."]
[null,"· Jowett M, Brunal MP, Flores G, Cylus J. (2016). “Spending targets for health: no magic number”. Health Financing Working Paper No. 1. WHO, Geneva  (link)"]
[null,"· World Health Organisation (2010). World Health Report: Chapter 2 “More money for health”. WHO, Geneva (link)"]
[]
[]
[]
[null,{"$f":"Results!K10","v":"Mise en commun des recettes"}]
[]
[]
[]
[]
[]
[]
[]
[]
[]
[]
[]
[]
[]
[]
[]
[]
[]
[]
[]
[]
[]
[]
[]
[]
[]
[null,{"$f":"'Pooling Revenues'!D8","v":"Q3.1 Cette question a été maintenant remplacé par l’étape 1 et le tableau de vue d’ensemble et ne constitue donc plus une question distincte. Merci de bien vous assurer que vous avez complété l’étape 1 car cela vous aidera à remplir les questions de cette section.\n"}]
[null,{"$f":"Results!F17","v":""}]
[]
[null,{"$f":"'Pooling Revenues'!D24","v":"Q3.2 Dans le cadre du processus global d’élaboration et de planification de la mise en œuvre des politiques de financement de la santé, quelle est l’approche de votre pays en matière de dispositifs de mise en commun des ressources ?"}]
[null,{"$f":"\"Scale = \"&Q3.2& \"/12\"","v":"Scale = 0/12"}]
[]
[null,{"$f":"Results!F18","v":""}]
[]
[null,{"$f":"'Pooling Revenues'!D40","v":"Q3.3 Dans quelle mesure la capacité de redistribution des fonds prépayés dans votre pays est-elle limitée par le cadre institutionnel du financement de la santé ?"}]
[null,{"$f":"\"Scale = \"&Q3.3& \"/12\"","v":"Scale = 0/12"}]
[]
[null,{"$f":"Results!F19","v":""}]
[]
[null,{"$f":"'Pooling Revenues'!D56","v":"Q3.4  Y-a-il des mesures, dans la conception des prestations, le paiement des prestataires ou les systèmes sous-jacents non financiers, qui visent à contrecarrer les problèmes découlant de la fragmentation de l’architecture du financement de la santé ?\n"}]
[null,{"$f":"\"Scale = \"&Q3.4& \"/12\"","v":"Scale = 0/12"}]
[]
[null,{"$f":"Results!F20","v":""}]
[]
[null,{"$f":"'Pooling Revenues'!D72","v":"Q3.5 Dans quelle mesure les différentes sources de recettes et de financement sont-elles organisées de manière complémentaire, afin de financer un paquet de prestations pour l’ensemble de la population ?\n"}]
[null,{"$f":"\"Scale = \"&Q3.5& \"/12\"","v":"Scale = 0/12"}]
[]
[null,{"$f":"Results!F21","v":""}]
[]
[null,{"$f":"'Pooling Revenues'!D88","v":"Q3.6 Dans quelle mesure les dispositifs d’assurance-maladie volontaire sont-ils une source d’inégalités, créant des effets de contagion potentiellement néfastes pour l’ensemble du système de santé ?\n"}]
[null,{"$f":"\"Scale = \"&Q3.6& \"/12\"","v":"Scale = 0/12"}]
[]
[null,{"$f":"Results!F22","v":""}]
[]
[null,{"$f":"'Pooling Revenues'!D104","v":"Q3.7 Dans quelle mesure les flux financiers sont-ils incohérents et redondants, et empêchent d’utiliser efficacement le budget public et les fonds des donateurs ?"}]
[null,{"$f":"\"Scale = \"&Q3.7& \"/12\"","v":"Scale = 0/12"}]
[]
[null,{"$f":"Results!F23","v":""}]
[]
[null,"Résumez ici les prochaines étapes, priorités ou points d’action que vous avez identifiés après avoir complété cette matrice relative aux Prestations et droits."]
[null,{"$f":"Results!M10","v":""}]
[]
[]
[null,"Further resources"]
[]
[]
[null,"Pooling revenues matrix – additional resources:"]
[null,"· WHO webpage on “Pooling revenues for health” (link)"]
[null,"· Module 3 of WHO e-learning course on health financing policy for UHC (register here)"]
[null,"· Kutzin J, Witter S, Jowett M, Bayarsaikhan D. (2017) “Developing a National Health Financing Strategy: A Reference Guide”. Health Financing Guidance No3. WHO, Geneva (link) (see relevant sections on pooling)"]
[null,"· Kutzin J, Witter S, Jowett M, Bayarsaikhan D. (2017) “Developing a National Health Financing Strategy: A Reference Guide”. Health Financing Guidance No3. WHO, Geneva (link) (see relevant sections on pooling)"]
[]
[null,"References for pooling revenues:"]
[null,"· World Health Organization (2010). “Fragmentation in pooling arrangements”.  Technical Brief Series – Brief No 5. WHO, Geneva (link)"]
[null,"· World Health Organisation (2010). World Health Report: Chapter 3 “Strength in numbers”. WHO, Geneva. (See pages 47-51) (link)"]
[null,"· Fuchs, VR (1996). “What every philosopher should know about health economics.”  Proceedings of the American Philosophical Society 140(2):186-196. [section on UHC, pp 157-158] "]
[]
[]
[]
[null,{"$f":"Results!K11","v":"Achats et paiement des prestataires"}]
[]
[]
[]
[]
[]
[]
[]
[]
[]
[]
[]
[]
[]
[]
[]
[]
[]
[]
[]
[]
[]
[]
[]
[]
[]
[]
[]
[]
[]
[]
[]
[]
[]
[]
[]
[]
[]
[]
[]
[]
[]
[]
[null,{"$f":"'Purchasing and Provider Payment'!D8","v":"Q4.1 Dans quelle mesure les allocations de fonds aux acheteurs de niveau inférieur, par exemple les administrations locales, et/ou les taux de paiement aux prestataires sont-ils le reflet des besoins de santé de la population ?\n"}]
[null,{"$f":"\"Scale = \"&Q4.1& \"/12\"","v":"Scale = 0/12"}]
[null,{"$f":"Results!F24","v":""}]
[]
[null,{"$f":"'Purchasing and Provider Payment'!D24","v":"Q4.2 Dans quelle mesure les paiements des prestataires sont-ils harmonisés entre régimes/sources de revenus et entre secteurs public et privé, afin de garantir des incitations cohérentes aux prestataires ?\n"}]
[null,{"$f":"\"Scale = \"&Q4.2& \"/12\"","v":"Scale = 0/12"}]
[]
[null,{"$f":"Results!F25","v":""}]
[]
[null,{"$f":"'Purchasing and Provider Payment'!D40","v":"Q4.3 Dans quelle mesure les méthodes de paiement des prestataires et les achats en général favorisent-ils la qualité des soins et la coordination des soins entre les spécialités et les différents niveaux de soins ?\n"}]
[null,{"$f":"\"Scale = \"&Q4.3& \"/12\"","v":"Scale = 0/12"}]
[]
[null,{"$f":"Results!F26","v":""}]
[]
[null,{"$f":"'Purchasing and Provider Payment'!D56","v":"Q4.4 Dans quelle mesure les contrats d’achat précisent-ils des exigences en matière de qualité des soins, y compris la disponibilité et la pertinence des soins, puis vérifient-ils de façon régulière qu’elles sont bien respectées ?\n"}]
[null,{"$f":"\"Scale = \"&Q4.4& \"/12\"","v":"Scale = 0/12"}]
[]
[null,{"$f":"Results!F27","v":""}]
[]
[null,{"$f":"'Purchasing and Provider Payment'!D72","v":"Q4.5 Dans quelle mesure les méthodes de paiement des prestataires favorisent-elles l’efficacité de l’allocation des ressources, par exemple en réduisant la prestation excessive ou en augmentant celle insuffisante des services, et gèrent-elles la croissance des dépenses ?\n"}]
[null,{"$f":"\"Scale = \"&Q4.5& \"/12\"","v":"Scale = 0/12"}]
[]
[null,{"$f":"Results!F28","v":""}]
[]
[null,{"$f":"'Purchasing and Provider Payment'!D88","v":"Q4.6 Dans quelle mesure les formulaires de consultation des patients sont-ils normalisés dans l'ensemble du système de santé et utilisés pour analyser et évaluer l'activité de l’ensemble des prestataires et de la population \n"}]
[null,{"$f":"\"Scale = \"&Q4.6& \"/12\"","v":"Scale = 0/12"}]
[]
[null,{"$f":"Results!F29","v":""}]
[]
[null,{"$f":"'Purchasing and Provider Payment'!D104","v":"Q4.7 Dans quelle mesure les paiements des prestataires  couvrent  uniquement une partie ou l’ensemble des coûts totaux (y compris les salaires, les dépenses récurrentes, etc.) ?\n\n\n"}]
[null,{"$f":"\"Scale = \"&Q4.7& \"/12\"","v":"Scale = 0/12"}]
[]
[null,{"$f":"Results!F30","v":""}]
[]
[null,{"$f":"'Purchasing and Provider Payment'!D120","v":"Q4.8 Dans quelle mesure les prestataires jouissent-ils d’une autonomie financière et sont-ils tenus responsables, dans une mesure réaliste et conforme à leurs capacités ?\n"}]
[null,{"$f":"\"Scale = \"&Q4.8& \"/12\"","v":"Scale = 0/12"}]
[]
[null,{"$f":"Results!F31","v":""}]
[]
[null,{"$f":"'Purchasing and Provider Payment'!D136","v":"Q4.9 Dans quelle mesure l’accréditation des prestataires ou les contrats sélectifs sont-ils établis, fonctionnels et utilisés pour les achats ?\n"}]
[null,{"$f":"\"Scale = \"&Q4.9& \"/12\"","v":"Scale = 0/12"}]
[]
[null,{"$f":"Results!F32","v":""}]
[]
[null,{"$f":"'Purchasing and Provider Payment'!D152","v":"Q4.10 Dans quelle mesure l’achat et le paiement des produits pharmaceutiques sont-ils mis en œuvre pour promouvoir l’utilisation efficace des médicaments (par exemple le recours aux génériques plutôt qu’aux princeps) et pour améliorer la protection financière des patients ?\n"}]
[null,{"$f":"\"Scale = \"&Q4.10& \"/12\"","v":"Scale = 0/12"}]
[]
[null,{"$f":"Results!F33","v":""}]
[]
[]
[null,"Résumez ici les prochaines étapes, priorités ou points d’action que vous avez identifiés après avoir complété cette matrice relative aux Prestations et droits."]
[null,{"$f":"Results!M11","v":""}]
[]
[null,"Further resources"]
[]
[]
[null,"Purchasing and provider payment matrix – additional resources:"]
[null,"· WHO webpage on “Purchasing and provider payment systems” (link)"]
[null,"· Module 4 of WHO e-learning course on health financing policy for UHC (register here)"]
[null,"· McIntyre D, Kutzin J. (2016). “Health financing country diagnostic: a foundation for national strategy development”. WHO Geneva (link) (see relevant sections on purchasing)"]
[null,"· Kutzin J, Witter S, Jowett M, Bayarsaikhan D. (2017) “Developing a National Health Financing Strategy: A Reference Guide”. Health Financing Guidance No3. WHO, Geneva (link) (see relevant sections on purchasing)"]
[]
[]
[]
[null,{"$f":"Results!K12","v":"Prestations et droits"}]
[]
[]
[]
[]
[]
[]
[]
[]
[]
[]
[]
[]
[]
[]
[]
[]
[]
[]
[]
[]
[]
[]
[null,{"$f":"'Benefits and Entitlements'!D8","v":"Q5.1 Cette question a été maintenant remplacé par l’étape 1 et le tableau de vue d’ensemble et ne constitue donc plus une question distincte. Merci de bien vous assurer que vous avez complété l’étape 1 car cela vous aidera à remplir les questions de cette section."}]
[null,{"$f":"Results!F34","v":""}]
[]
[null,{"$f":"'Benefits and Entitlements'!D24","v":"Q5.2 Dans quelle mesure les décisions et les révisions relatives aux prestations sont-elles prises de manière transparente, sur la base d’un processus clairement défini et de critères convenus, tels que le rapport coût-efficacité, la protection financière, l’impact budgétaire ?\n"}]
[null,{"$f":"\"Scale = \"&Q5.2& \"/12\"","v":"Scale = 0/12"}]
[]
[null,{"$f":"Results!F35","v":""}]
[]
[null,{"$f":"'Benefits and Entitlements'!D40","v":"Q5.3 Dans quelle mesure les droits à prestation reflètent-ils explicitement les besoins de santé de la population ?\n"}]
[null,{"$f":"\"Scale = \"&Q5.3& \"/12\"","v":"Scale = 0/12"}]
[]
[null,{"$f":"Results!F36","v":""}]
[]
[null,{"$f":"'Benefits and Entitlements'!D56","v":"Q5.4 Dans quelle mesure les prestations accordent-elles la priorité aux catégories de population prioritaires, par exemple pour une meilleure utilisation des services hautement prioritaires et pour la protection financière ?\n"}]
[null,{"$f":"\"Scale = \"&Q5.4& \"/12\"","v":"Scale = 0/12"}]
[]
[null,{"$f":"Results!F37","v":""}]
[]
[null,{"$f":"'Benefits and Entitlements'!D72","v":"Q5.5 Dans quelle mesure les droits et obligations de la population sont-ils explicitement définis et compris par les intéressés ?\n"}]
[null,{"$f":"\"Scale = \"&Q5.5& \"/12\"","v":"Scale = 0/12"}]
[]
[null,{"$f":"Results!F38","v":""}]
[]
[null,{"$f":"'Benefits and Entitlements'!D88","v":"Q5.6 Dans quelle mesure les prestations sont-elles alignées sur le paiement des prestataires, afin de s’assurer qu’elles sont fournies et que les patients bénéficient d’une protection financière ?\n"}]
[null,{"$f":"\"Scale = \"&Q5.6& \"/12\"","v":"Scale = 0/12"}]
[]
[null,{"$f":"Results!F39","v":""}]
[]
[null,{"$f":"'Benefits and Entitlements'!D104","v":"Q5.7 Dans quelle mesure les prestations, y compris le partage des coûts pour les patients, sont-elles alignées sur les recettes, afin d’assurer un financement adéquat des droits à prestations approuvés ?\n"}]
[null,{"$f":"\"Scale = \"&Q5.7& \"/12\"","v":"Scale = 0/12"}]
[]
[null,{"$f":"Results!F40","v":""}]
[]
[null,"Résumez ici les prochaines étapes, priorités ou points d’action que vous avez identifiés après avoir complété cette matrice relative aux Prestations et droits."]
[null,{"$f":"Results!M12","v":""}]
[]
[]
[]
[null,"Further resources"]
[]
[]
[null,"Benefit design matrix – additional resources:"]
[null,"· WHO webpage on “Benefit design” (link)"]
[null,"· Module 5 of WHO e-learning course on health financing policy for UHC (register here)"]
[null,"· McIntyre D, Kutzin J. (2016). “Health financing country diagnostic: a foundation for national strategy development”. WHO Geneva (link) (see relevant sections on benefit entitlements in Annex B)"]
[null,"· Kutzin J, Witter S, Jowett M, Bayarsaikhan D. (2017) “Developing a National Health Financing Strategy: A Reference Guide”. Health Financing Guidance No3. WHO, Geneva (link) (see relevant sections on benefit design)"]
[]
[null,"References for benefit design and health financing:"]
[null,"· Treerutkuarkul A (2010). “Thailand: health care for all, at a price.” Bulletin of the World Health Organization 88(2):84–85. (link)"]
[null,"· World Health Organisation (2017). “Priority-setting for national health policies, strategies and plans”. Chapter 4 in “Strategizing national health in the 21st century: a handbook”. WHO Geneva (link)"]
[null,"· WHO Consultative Group on Equity and Universal Health Coverage (2014). Final Report: “Making fair choices on the path to universal health coverage”. WHO Geneva 2014. (Pages x-xii) (link)"]
[null,"· Meessen, B, L Gilson, A Tibouti, eds. (2011). “User fee removal in the health sector in low-income countries: lessons from recent national initiatives”. Health Policy and Planning (suppl 2). (link)"]
[]
[]
[]
[]
[null,{"$f":"Results!B41","v":"Gestion des finances publiques (GFP)"}]
[]
[]
[]
[]
[]
[]
[]
[]
[]
[]
[]
[]
[]
[]
[]
[]
[]
[]
[]
[]
[]
[]
[]
[]
[]
[]
[]
[null,{"$f":"PFM!D8","v":"Q6.1 Est-ce qu’un diagnostic/une évaluation approfondi(e) des goulets d’étranglement de la GFP dans le secteur de la santé a été effectué(e) récemment, par exemple au cours des trois dernières années ?"}]
[null,{"$f":"\"Scale = \"&Q6.1& \"/12\"","v":"Scale = 0/12"}]
[]
[null,{"$f":"Results!F41","v":""}]
[]
[null,{"$f":"PFM!D24","v":"Q6.2 Le personnel du Ministère de la santé dispose-t-il de capacités à comprendre les (nouvelles) règles de GFP et à les appliquer au processus budgétaire du secteur de la santé ?"}]
[null,{"$f":"\"Scale = \"&Q6.2& \"/12\"","v":"Scale = 0/12"}]
[]
[null,{"$f":"Results!F42","v":""}]
[]
[null,{"$f":"PFM!D40","v":"Q6.3 Existe-il un processus budgétaire pluriannuel mis en œuvre efficacement ?"}]
[null,{"$f":"\"Scale = \"&Q6.3& \"/12\"","v":"Scale = 0/12"}]
[]
[null,{"$f":"Results!F43","v":""}]
[]
[null,{"$f":"PFM!D56","v":"Q6.4 Dans quelle mesure les allocations budgétaires annuelles en matière de santé sont alignées sur les priorités du secteur de la santé (niveau, structure, nature/objectif) ?"}]
[null,{"$f":"\"Scale = \"&Q6.4& \"/12\"","v":"Scale = 0/12"}]
[]
[null,{"$f":"Results!F44","v":""}]
[]
[null,{"$f":"PFM!D72","v":"Q6.5 Dans quelle mesure le processus budgétaire est consultatif, transparent et un processus d’examen et d’ajustement budgétaire à mi-parcours est établi ?"}]
[null,{"$f":"\"Scale = \"&Q6.5& \"/12\"","v":"Scale = 0/12"}]
[]
[null,{"$f":"Results!F45","v":""}]
[]
[null,{"$f":"PFM!D88","v":"Q6.6 Dans quelle mesure les transferts fiscaux sont conçus et mis en œuvre de sorte à améliorer l’équité de la distribution des ressources dans le secteur de la santé?"}]
[null,{"$f":"\"Scale = \"&Q6.6& \"/12\"","v":"Scale = 0/12"}]
[]
[null,{"$f":"Results!F46","v":""}]
[]
[null,{"$f":"PFM!D104","v":"Q6.7 Dans quelle mesure les règles du budget de la santé permettent-elles une certaine souplesse des dépenses? "}]
[null,{"$f":"\"Scale = \"&Q6.7& \"/12\"","v":"Scale = 0/12"}]
[]
[null,{"$f":"Results!F47","v":""}]
[]
[null,{"$f":"PFM!D120","v":"Q6.8 La flexibilité dans l’utilisation des ressources est-elle assurée ou déléguée au bon niveau?"}]
[null,{"$f":"\"Scale = \"&Q6.8& \"/12\"","v":"Scale = 0/12"}]
[]
[null,{"$f":"Results!F48","v":""}]
[]
[null,{"$f":"PFM!D136","v":"Q6.9 Dans quelle mesure des politiques de discipline budgétaire visant à contrôler les dépenses sont en vigueur (par exemple, gestion de la trésorerie, respect des règles d’approvisionnement) et mises en œuvre efficacement?"}]
[null,{"$f":"\"Scale = \"&Q6.9& \"/12\"","v":"Scale = 0/12"}]
[]
[null,{"$f":"Results!F49","v":""}]
[]
[null,{"$f":"PFM!D152","v":"Q6.10 Dans quelle mesure des systèmes d’information sont en place pour répondre aux besoins en matière de responsabilité financière et pour assurer le suivi des performances du secteur de la santé?"}]
[null,{"$f":"\"Scale = \"&Q6.10& \"/12\"","v":"Scale = 0/12"}]
[]
[null,{"$f":"Results!F50","v":""}]
[]
[null,{"$f":"PFM!D168","v":"Q6.11 Dans quelle mesure les flux financiers multiples, la structure budgétaire et les règles de GFP sont alignés sur les politiques d’achats stratégiques?"}]
[null,{"$f":"\"Scale = \"&Q6.11& \"/12\"","v":"Scale = 0/12"}]
[]
[null,{"$f":"Results!F51","v":""}]
[]
[]
[null,"Résumez ici les prochaines étapes, priorités ou points d’action que vous avez identifiés après avoir complété cette matrice relative aux Prestations et droits."]
[null,{"$f":"Results!M13","v":""}]
[]
[]
[]
[null,{"$f":"Results!K14","v":"Gouvernance"}]
[]
[]
[]
[]
[]
[]
[]
[]
[]
[]
[]
[]
[]
[]
[]
[]
[]
[]
[]
[]
[]
[]
[]
[]
[]
[null,{"$f":"Governance!D8","v":"Q7.1 Dans quelle mesure les rôles et les responsabilités (liés aux objectifs de financement de la santé et au rendement en matière de collecte de recettes, de mise en commun, d’achats, de prestations, etc.) sont clairement définis et répartis entre les institutions responsables du financement de la santé ?"}]
[null,{"$f":"\"Scale = \"&Q7.1& \"/12\"","v":"Scale = 0/12"}]
[]
[null,{"$f":"Results!F52","v":""}]
[]
[null,{"$f":"Governance!D24","v":"Q7.2 Dans quelle mesure les institutions responsables du financement de la santé disposent-elles de capacités adéquates, notamment en matière de ressources humaines (capacités techniques et managériales) et de TIC ?"}]
[null,{"$f":"\"Scale = \"&Q7.2& \"/12\"","v":"Scale = 0/12"}]
[]
[null,{"$f":"Results!F53","v":""}]
[]
[null,{"$f":"Governance!D40","v":"Q7.3 Dans quelle mesure les mécanismes de responsabilisation des organismes d’achat/de financement (y compris l’autonomie et le conseil d’administration de l’agence d’assurance-maladie, les mécanismes de récompense/sanction, etc.) sont-ils en place pour s’assurer que la politique de financement de la santé appuie les progrès vers les objectifs du secteur et que les fonds sont utilisés efficacement pour les populations, programmes et services prioritaires ?"}]
[null,{"$f":"\"Scale = \"&Q7.3& \"/12\"","v":"Scale = 0/12"}]
[]
[null,{"$f":"Results!F54","v":""}]
[]
[null,{"$f":"Governance!D56","v":"Q7.4 L’utilisation des fonds ou les performances des institutions achetant des services auprès des prestataires de services de santé ou le budget de la santé ont-ils été communiqués au public (par exemple sous forme de rapport annuel) ?"}]
[null,{"$f":"\"Scale = \"&Q7.4& \"/12\"","v":"Scale = 0/12"}]
[]
[null,{"$f":"Results!F55","v":""}]
[]
[null,{"$f":"Governance!D72","v":"Q7.5 Dans quelle mesure le Ministère des finances, le Ministère de la santé et l’organisme national d’assurance-maladie participent au processus d’élaboration des politiques de financement de la santé et en sont informés ?"}]
[null,{"$f":"\"Scale = \"&Q7.5& \"/12\"","v":"Scale = 0/12"}]
[]
[null,{"$f":"Results!F56","v":""}]
[]
[null,{"$f":"Governance!D88","v":"Q7.6 Dans quelle mesure le processus d’élaboration des politiques de financement de la santé est transparent et participatif?"}]
[null,{"$f":"\"Scale = \"&Q7.6& \"/12\"","v":"Scale = 0/12"}]
[]
[null,{"$f":"Results!F57","v":""}]
[]
[]
[null,"Résumez ici les prochaines étapes, priorités ou points d’action que vous avez identifiés après avoir complété cette matrice relative aux Prestations et droits."]
[null,{"$f":"Results!M14","v":""}]

{"sheet":"Instructions","index":4,"n_rows":58,"n_cols":11,"rows_kept":58,"cut":false,"hidden":true,"merged":[[2,4,2,13],[6,2,12,15],[48,2,49,4],[48,5,49,15],[18,7,18,14],[20,7,20,14],[4,2,4,15],[14,2,15,4],[14,5,15,15],[32,2,33,4],[32,5,40,15],[24,8,24,9],[42,2,43,4],[42,5,43,15],[24,10,24,11],[56,10,56,12],[22,7,22,14],[51,2,52,4],[51,5,52,15],[25,8,25,9],[26,8,26,9],[25,10,25,11],[26,10,26,11],[45,2,46,4],[45,5,46,15],[29,2,30,4],[29,5,30,15]]}
[1]
[]
[null,null,null,null,"MATRICE DE PROGRÈS POUR LE FINANCEMENT DE LA SANTÉ"]
[]
[null,null,"INSTRUCTIONS - UTILISATION DES MATRICE"]
[]
[null,null,"Généralités: les matrices visent à étayer la réflexion dans votre pays sur les questions relatives aux politiques de financement de la santé, en fournissant la structure nécessaire à une analyse qualitative. Elles viennent en complément des indicateurs quantitatifs, par exemple la composition des sources de recettes, les dépenses publiques par habitant par région et la protection financière des patients, et doivent être utilisées conjointement avec ces indicateurs. Sur la base de données mondiales et d’une série d’hypothèses, les matrices reflètent la réflexion actuelle de l’OMS sur la manière dont la politique de financement de la santé peut contribuer aux progrès en matière de CSU. Elles vous aident non seulement à évaluer les progrès réalisés au fil du temps, mais également à identifier les prochaines étapes et priorités pour votre pays, par exemple, approfondir les travaux d’analyse ou élaborer/réviser une stratégie de financement de la santé.\n\nL’OMS recommande que les matrices soient utilisées en deux étapes : tout d’abord, un expert technique les complète en compilant des informations pertinentes et utiles provenant, par exemple, de documents clés et de données quantitatives. Deuxièmement, l’expert technique anime une discussion autour de ces matrices, avec les principales parties prenantes.\n\nLes matrices peuvent être complétées en intégralité ou en partie, selon vos priorités actuelles et le temps dont vous disposez. Certaines questions peuvent ne pas être pertinentes dans votre pays et vous avez la possibilité de l’indiquer pour chaque question. Enfin, votre évaluation ne fait pas partie d’une évaluation officielle de l’OMS et aucune comparaison directe ne sera faite avec les performances d’autres pays\n"]
[]
[]
[]
[]
[]
[]
[]
[null,null,"# 1 : ",null,null,"Commencez par compléter les informations suivantes, qui seront incluses dans la première page de votre rapport imprimé :"]
[]
[]
[]
[null,null,null,null,null,null,"Nom du pays :"]
[]
[null,null,null,null,null,null,"Rempli par :"]
[]
[null,null,null,null,null,null,"Processus suivi:"]
[]
[null,null,null,null,null,null,null,null,"Année",null,"Mois"]
[null,null,null,null,null,null,"Période couverte :","De : "]
[null,null,null,null,null,null,"consideration:","À : "]
[]
[]
[null,null,"# 2 : ",null,null,"• Pour l'étape 2, nous recommandons de compléter un aperçu descriptif des différents dispositifs de couverture santé dans votre pays. Cela permet, de manière synthétique de faire le point sur comment la couverture santé est fournie dans votre pays, par exemple à travers un système de santé financé par l'État, des programmes de soins gratuits ciblés et/ou une assurance maladie obligatoire pour les travailleurs salariés. Pour chacun de ces dispositifs, détaillez les principales caractéristiques décrites dans les colonnes du tableau."]
[]
[]
[null,null,"# 3 : ",null,null,"• Une fois la description générale de l'étape 2 terminée, passez à l'étape 3. Comme indiqué ci-dessus, vous pouvez aborder les matrices soit par une fonction de financement de la santé, un objectif intermédiaire ou final de couverture, ou une combinaison des deux. Examinez chaque question dans une matrice et les quatre \"étapes de progression\" qui s'y rapportent. Recueillez les informations pertinentes et faites une évaluation de la situation dans votre pays.\nsuivant.....\n•  Il y a deux cases à la fin de chaque matrice ; dans la première, vous pouvez indiquer les points d'action clés découlant des discussions, qui seront inclus dans votre rapport imprimé. Dans la seconde case, vous pouvez suggérer des améliorations des matrices proposées.\n"]
[]
[]
[]
[]
[]
[]
[]
[]
[]
[null,null,"# 4 : ",null,null,"Vous pouvez vérifier l’état de votre évaluation en retournant dans le menu et en cliquant sur « Vérifier l’état d’avancement »."]
[]
[]
[null,null,"# 5 : ",null,null,"Vous pouvez vérifier l’état de votre évaluation en retournant dans le menu et en cliquant sur « Votre évaluation »."]
[]
[]
[null,null,"# 6 : ",null,null," Vous pouvez obtenir un résumé de l’impact de la politique de financement de la santé dans votre pays sur les objectifs du système de santé en cliquant sur « Objectifs du système de santé » sur la page Menu."]
[]
[]
[null,null,"# 7 : ",null,null,"Imprimez vos résultats à partir de la page Menu. Votre évaluation sera exportée dans un fichier PDF en format résumé ou complet, ou en format texte dans un fichier Excel."]
[]
[]
[null,null,"Commencez à compléter les matrices en cliquant ci-dessous."]
[null,null,"En remplissant les matrices de progrès, vous confirmez que votre organisation vous autorise à signer le présent contrat en lieu "]
[null,null,"place de l’organisation et que vous avez lu et accepté les conditions de la",null,null,null,null,null,null,null,"collecte de données."]
[null,null," organization’s behalf and that you have read and agree with the terms for data collection"]

{"sheet":"Your Assessment","index":5,"n_rows":52,"n_cols":12,"rows_kept":52,"cut":false,"hidden":true,"merged":[[51,2,53,5],[5,3,5,5],[6,11,7,15],[3,2,3,15],[5,6,5,9],[11,2,13,5],[43,2,45,5],[47,2,49,5],[9,11,25,15],[23,2,25,5],[27,2,29,5],[31,2,33,5],[35,2,37,5],[39,2,41,5],[15,2,17,5],[19,2,21,5]]}
[1]
[]
[null,null,null,"MATRICE DE PROGRÈS POUR LE FINANCEMENT DE LA SANTÉ"]
[null,null,"RÉSUMÉ DE VOTRE ÉVALUATION"]
[null,null,null,"↓"]
[null,null,"Cliquez sur la zone de texte pour sélectionner une matrice","Processus d’élaboration des politiques",null,null,"Votre évaluation"]
[null,null,null,null,null,null,null,null,null,null,null,"Points d’action"]
[null,null,"Questions",null,null,null,null," "]
[]
[null,null,{"$f":"Results!P9","v":"1. Processus d’élaboration des politiques"},null,null,null,null,null,null,null,null,{"$f":"Results!T8","v":""}]
[]
[null,null,{"$f":"Results!R8","v":"1.1. Le système de financement de la santé de votre pays a-t-il récemment fait l’objet d’un diagnostic ou d’une évaluation approfondie qui examine son impact sur les performances du système de santé ainsi que les causes des problèmes de performance ?"}]
[]
[]
[]
[null,null,{"$f":"Results!R9","v":"1.2. A-t-on transposé en textes de loi/décrets une déclaration de politique récente relative au financement de la santé ?"}]
[]
[]
[]
[null,null,{"$f":"Results!R10","v":"1.3. Existe-t-il un système de suivi régulier du financement de la santé, et si oui les données sont-elles utilisées pour suivre les progrès effectués (par exemple sur les modèles de dépenses et la protection financière) et pour renforcer la reddition de comptes ?"}]
[]
[]
[]
[null,null,{"$f":"Results!R11","v":"1.4. Les études d’évaluation sont-elles réalisées sur une base systématique pour mesurer les conséquences de la mise en œuvre de réformes spécifiques du financement sur les objectifs du système de santé et dans quelles mesure les résultats servent-ils à guider la conception et la révision des politiques de financement de la santé ?"}]
[]
[]
[]
[null,null,{"$f":"Results!R12","v":""}]
[]
[]
[]
[null,null,{"$f":"Results!R13","v":""}]
[]
[]
[]
[null,null,{"$f":"Results!R14","v":""}]
[]
[]
[]
[null,null,{"$f":"Results!R15","v":""}]
[]
[]
[]
[null,null,{"$f":"Results!R16","v":""}]
[]
[]
[]
[null,null,{"$f":"Results!R17","v":""}]
[]
[]
[]
[null,null,{"$f":"Results!R18","v":""}]

{"sheet":"Completeness","index":6,"n_rows":166,"n_cols":15,"rows_kept":166,"cut":false,"hidden":true,"merged":[[136,2,138,11],[139,2,141,11],[142,2,144,11],[145,2,147,11],[136,12,138,13],[139,12,141,13],[142,12,144,13],[145,12,147,13],[136,14,138,15],[139,14,141,15],[142,14,144,15],[145,14,147,15],[59,12,59,13],[59,14,59,15],[91,12,91,13],[91,14,91,15],[114,12,114,13],[114,14,114,15],[149,12,149,13],[149,14,149,15],[165,12,167,13],[165,14,167,15],[156,12,158,13],[156,14,158,15],[159,12,161,13],[159,14,161,15],[162,12,164,13],[162,14,164,15],[133,12,135,13],[133,14,135,15],[150,12,152,13],[150,14,152,15],[153,12,155,13],[153,14,155,15],[124,12,126,13],[124,14,126,15],[127,12,129,13],[127,14,129,15],[130,12,132,13],[130,14,132,15],[115,12,117,13],[115,14,117,15],[118,12,120,13],[118,14,120,15],[121,12,123,13],[121,14,123,15],[104,12,106,13],[104,14,106,15],[107,12,109,13],[107,14,109,15],[110,12,112,13],[110,14,112,15],[98,12,100,13],[98,14,100,15],[101,12,103,13],[101,14,103,15],[87,12,89,13],[87,14,89,15],[95,12,97,13],[95,14,97,15],[78,12,80,13],[78,14,80,15],[81,12,83,13],[81,14,83,15],[84,12,86,13],[84,14,86,15],[92,12,94,15],[69,12,71,13],[69,14,71,15],[72,12,74,13],[72,14,74,15],[75,12,77,13],[75,14,77,15],[60,12,62,13],[60,14,62,15],[63,12,65,13],[63,14,65,15],[66,12,68,13],[66,14,68,15],[49,12,51,13],[49,14,51,15],[52,12,54,13],[52,14,54,15],[55,12,57,13],[55,14,57,15],[40,12,42,13],[40,14,42,15],[43,12,45,13],[43,14,45,15],[46,12,48,13],[46,14,48,15],[32,12,34,13],[32,14,34,15],[20,14,22,15],[23,12,25,13],[23,14,25,15],[26,12,28,13],[26,14,28,15],[29,12,31,13],[29,14,31,15],[36,12,36,13],[36,14,36,15],[37,12,39,15],[159,2,161,11],[162,2,164,11],[165,2,167,11],[6,12,8,13],[6,14,8,15],[9,12,11,13],[9,14,11,15],[12,12,14,13],[12,14,14,15],[20,12,22,13],[127,2,129,11],[130,2,132,11],[133,2,135,11],[150,2,152,11],[153,2,155,11],[156,2,158,11],[107,2,109,11],[110,2,112,11],[115,2,117,11],[118,2,120,11],[121,2,123,11],[124,2,126,11],[87,2,89,11],[92,2,94,11],[95,2,97,11],[98,2,100,11],[101,2,103,11],[104,2,106,11],[69,2,71,11],[72,2,74,11],[75,2,77,11],[78,2,80,11],[81,2,83,11],[84,2,86,11],[49,2,51,11],[52,2,54,11],[55,2,57,11],[60,2,62,11],[63,2,65,11],[66,2,68,11],[32,2,34,11],[37,2,39,11],[40,2,42,11],[43,2,45,11],[46,2,48,11],[2,3,2,14],[9,2,11,11],[12,2,14,11],[20,2,22,11],[23,2,25,11],[26,2,28,11],[29,2,31,11],[3,2,3,15],[6,2,8,11],[5,12,5,13],[5,14,5,15],[19,12,19,13],[19,14,19,15],[15,2,17,11],[15,12,17,13],[15,14,17,15]]}
[1]
[]
[null,null,null,"MATRICE DE PROGRÈS POUR LE FINANCEMENT DE LA SANTÉ"]
[null,null,"Quel est l’état d’avancement de votre évaluation ?"]
[]
[null,null,{"$f":"'Policy Development Process'!D5","v":"1. Processus d’élaboration des politiques"},null,null,null,null,null,null,null,null,null,"Réponse « zone de texte »",null,"Réponse « curseur »"]
[null,null,{"$f":"Results!C8&\" \"&Results!D8","v":"Q1.1 Le système de financement de la santé de votre pays a-t-il récemment fait l’objet d’un diagnostic ou d’une évaluation approfondie qui examine son impact sur les performances du système de santé ainsi que les causes des problèmes de performance ?"},null,null,null,null,null,null,null,null,null,{"$f":"IF(Results!G8=TRUE,\"Non pertinent\",IF(Results!F8=\"\",\"Non terminé\",\"Terminé\"))","v":"Non terminé"},null,{"$f":"IF(Results!G8=TRUE,\"Non pertinent\",IF(Results!E8=0,\"Non terminé\",\"Terminé\"))","v":"Non terminé"}]
[]
[]
[null,null,{"$f":"Results!C9&\" \"&Results!D9","v":"Q1.2 A-t-on transposé en textes de loi/décrets une déclaration de politique récente relative au financement de la santé ?"},null,null,null,null,null,null,null,null,null,{"$f":"IF(Results!G9=TRUE,\"Non pertinent\",IF(Results!F9=\"\",\"Non terminé\",\"Terminé\"))","v":"Non terminé"},null,{"$f":"IF(Results!G9=TRUE,\"Non pertinent\",IF(Results!E9=0,\"Non terminé\",\"Terminé\"))","v":"Non terminé"}]
[]
[]
[null,null,{"$f":"Results!C10&\" \"&Results!D10","v":"Q1.3 Existe-t-il un système de suivi régulier du financement de la santé, et si oui les données sont-elles utilisées pour suivre les progrès effectués (par exemple sur les modèles de dépenses et la protection financière) et pour renforcer la reddition de comptes ?"},null,null,null,null,null,null,null,null,null,{"$f":"IF(Results!G10=TRUE,\"Non pertinent\",IF(Results!F10=\"\",\"Non terminé\",\"Terminé\"))","v":"Non terminé"},null,{"$f":"IF(Results!G10=TRUE,\"Non pertinent\",IF(Results!E10=0,\"Non terminé\",\"Terminé\"))","v":"Non terminé"}]
[]
[]
[null,null,{"$f":"Results!C11&\" \"&Results!D11","v":"Q1.4 Les études d’évaluation sont-elles réalisées sur une base systématique pour mesurer les conséquences de la mise en œuvre de réformes spécifiques du financement sur les objectifs du système de santé et dans quelles mesure les résultats servent-ils à guider la conception et la révision des politiques de financement de la santé ?"},null,null,null,null,null,null,null,null,null,{"$f":"IF(Results!G11=TRUE,\"Non pertinent\",IF(Results!F11=\"\",\"Non terminé\",\"Terminé\"))","v":"Non terminé"},null,{"$f":"IF(Results!G11=TRUE,\"Non pertinent\",IF(Results!E11=0,\"Non terminé\",\"Terminé\"))","v":"Non terminé"}]
[]
[]
[]
[null,null,{"$f":"'Revenue Raising'!D5","v":"2. Collecte de recettes"},null,null,null,null,null,null,null,null,null,"Réponse « zone de texte »",null,"Réponse « curseur »"]
[null,null,{"$f":"Results!C12&\" \"&Results!D12","v":"Q2.1 Quelle approche est en vigueur dans votre pays en matière d’élaboration de politiques et de stratégies de collecte de revenus ? Cette approche s'inscrit-elle dans le cadre du processus global d’élaboration et de planification de la mise en œuvre des politiques de financement de la santé ?"},null,null,null,null,null,null,null,null,null,{"$f":"IF(Results!G12=TRUE,\"Non pertinent\",IF(Results!F12=\"\",\"Non terminé\",\"Terminé\"))","v":"Non terminé"},null,{"$f":"IF(Results!G12=TRUE,\"Non pertinent\",IF(Results!E12=0,\"Non terminé\",\"Terminé\"))","v":"Non terminé"}]
[]
[]
[null,null,{"$f":"Results!C13&\" \"&Results!D13","v":"Q2.2 Dans quelle mesure le financement de la santé dans votre pays repose-t-il sur des sources de financement public/obligatoire (par exemple, fiscalité/recettes publiques, y compris les cotisations obligatoires à l’assurance-maladie nationale/sociale) ?"},null,null,null,null,null,null,null,null,null,{"$f":"IF(Results!G13=TRUE,\"Non pertinent\",IF(Results!F13=\"\",\"Non terminé\",\"Terminé\"))","v":"Non terminé"},null,{"$f":"IF(Results!G13=TRUE,\"Non pertinent\",IF(Results!E13=0,\"Non terminé\",\"Terminé\"))","v":"Non terminé"}]
[]
[]
[null,null,{"$f":"Results!C14&\" \"&Results!D14","v":"Q2.3 Dans quelle mesure le financement public de la santé dans votre pays est-il prédictible sur plusieurs années ?"},null,null,null,null,null,null,null,null,null,{"$f":"IF(Results!G14=TRUE,\"Non pertinent\",IF(Results!F14=\"\",\"Non terminé\",\"Terminé\"))","v":"Non terminé"},null,{"$f":"IF(Results!G14=TRUE,\"Non pertinent\",IF(Results!E14=0,\"Non terminé\",\"Terminé\"))","v":"Non terminé"}]
[]
[]
[null,null,{"$f":"Results!C15&\" \"&Results!D15","v":"Q2.4 Dans quelle mesure le flux de fonds publics est-il stable, notamment grâce à une exécution budgétaire régulière, c’est-à-dire un déblocage des fonds dans les délais, conformément aux budgets de santé approuvés ?"},null,null,null,null,null,null,null,null,null,{"$f":"IF(Results!G15=TRUE,\"Non pertinent\",IF(Results!F15=\"\",\"Non terminé\",\"Terminé\"))","v":"Non terminé"},null,{"$f":"IF(Results!G15=TRUE,\"Non pertinent\",IF(Results!E15=0,\"Non terminé\",\"Terminé\"))","v":"Non terminé"}]
[]
[]
[null,null,{"$f":"Results!C16&\" \"&Results!D16","v":"Q2.5 Dans quelle mesure les différentes sources de revenus sont-elles collectées de façon progressive (c.-à-d. en fonction de la capacité de payer), et partant de là favorisent l’équité dans le mode de financement du système de santé ?"},null,null,null,null,null,null,null,null,null,{"$f":"IF(Results!G16=TRUE,\"Non pertinent\",IF(Results!F16=\"\",\"Non terminé\",\"Terminé\"))","v":"Non terminé"},null,{"$f":"IF(Results!G16=TRUE,\"Non pertinent\",IF(Results!E16=0,\"Non terminé\",\"Terminé\"))","v":"Non terminé"}]
[]
[]
[]
[null,null,{"$f":"'Pooling Revenues'!D5","v":"3. Mise en commun des recettes"},null,null,null,null,null,null,null,null,null,"Réponse « zone de texte »",null,"Réponse « curseur »"]
[null,null,{"$f":"Results!C17&\" \"&Results!D17","v":"Q3.1 Cette question a été maintenant remplacé par l’étape 1 et le tableau de vue d’ensemble et ne constitue donc plus une question distincte. Merci de bien vous assurer que vous avez complété l’étape 1 car cela vous aidera à remplir les questions de cette section."},null,null,null,null,null,null,null,null,null,"N'est pas applicable"]
[]
[]
[null,null,{"$f":"Results!C18&\" \"&Results!D18","v":"Q3.2 Dans le cadre du processus global d’élaboration et de planification de la mise en œuvre des politiques de financement de la santé, quelle est l’approche de votre pays en matière de dispositifs de mise en commun des ressources ?"},null,null,null,null,null,null,null,null,null,{"$f":"IF(Results!G18=TRUE,\"Non pertinent\",IF(Results!F18=\"\",\"Non terminé\",\"Terminé\"))","v":"Non terminé"},null,{"$f":"IF(Results!G18=TRUE,\"Non pertinent\",IF(Results!E18=0,\"Non terminé\",\"Terminé\"))","v":"Non terminé"}]
[]
[]
[null,null,{"$f":"Results!C19&\" \"&Results!D19","v":"Q3.3 Dans quelle mesure la capacité de redistribution des fonds prépayés dans votre pays est-elle limitée par le cadre institutionnel du financement de la santé ?"},null,null,null,null,null,null,null,null,null,{"$f":"IF(Results!G19=TRUE,\"Non pertinent\",IF(Results!F19=\"\",\"Non terminé\",\"Terminé\"))","v":"Non terminé"},null,{"$f":"IF(Results!G19=TRUE,\"Non pertinent\",IF(Results!E19=0,\"Non terminé\",\"Terminé\"))","v":"Non terminé"}]
[]
[]
[null,null,{"$f":"Results!C20&\" \"&Results!D20","v":"Q3.4 Y-a-il des mesures, dans la conception des prestations, le paiement des prestataires ou les systèmes sous-jacents non financiers, qui visent à contrecarrer les problèmes découlant de la fragmentation de l’architecture du financement de la santé ?"},null,null,null,null,null,null,null,null,null,{"$f":"IF(Results!G20=TRUE,\"Non pertinent\",IF(Results!F20=\"\",\"Non terminé\",\"Terminé\"))","v":"Non terminé"},null,{"$f":"IF(Results!G20=TRUE,\"Non pertinent\",IF(Results!E20=0,\"Non terminé\",\"Terminé\"))","v":"Non terminé"}]
[]
[]
[null,null,{"$f":"Results!C21&\" \"&Results!D21","v":"Q3.5 Dans quelle mesure les différentes sources de revenus et de financement sont-elles organisées de manière complémentaire, afin de financer un paquet de prestations pour l’ensemble de la population ?"},null,null,null,null,null,null,null,null,null,{"$f":"IF(Results!G21=TRUE,\"Non pertinent\",IF(Results!F21=\"\",\"Non terminé\",\"Terminé\"))","v":"Non terminé"},null,{"$f":"IF(Results!G21=TRUE,\"Non pertinent\",IF(Results!E21=0,\"Non terminé\",\"Terminé\"))","v":"Non terminé"}]
[]
[]
[null,null,{"$f":"Results!C22&\" \"&Results!D22","v":"Q3.6 Dans quelle mesure les dispositifs d’assurance-maladie volontaire sont-ils une source d’inégalités, créant des effets de contagion potentiellement néfastes pour l’ensemble du système de santé ?"},null,null,null,null,null,null,null,null,null,{"$f":"IF(Results!G22=TRUE,\"Non pertinent\",IF(Results!F22=\"\",\"Non terminé\",\"Terminé\"))","v":"Non terminé"},null,{"$f":"IF(Results!G22=TRUE,\"Non pertinent\",IF(Results!E22=0,\"Non terminé\",\"Terminé\"))","v":"Non terminé"}]
[]
[]
[null,null,{"$f":"Results!C23&\" \"&Results!D23","v":"Q3.7 Dans quelle mesure les flux financiers sont-ils incohérents et redondants, et empêchent d’utiliser efficacement le budget public et les fonds des donateurs ?"},null,null,null,null,null,null,null,null,null,{"$f":"IF(Results!G23=TRUE,\"Non pertinent\",IF(Results!F23=\"\",\"Non terminé\",\"Terminé\"))","v":"Non terminé"},null,{"$f":"IF(Results!G23=TRUE,\"Non pertinent\",IF(Results!E23=0,\"Non terminé\",\"Terminé\"))","v":"Non terminé"}]
[]
[]
[]
[null,null,{"$f":"'Purchasing and Provider Payment'!D5","v":"4. Achats et paiement des prestataires"},null,null,null,null,null,null,null,null,null,"Réponse « zone de texte »",null,"Réponse « curseur »"]
[null,null,{"$f":"Results!C24&\" \"&Results!D24","v":"Q4.1 Dans quelle mesure les allocations de fonds aux acheteurs de niveau inférieur, par exemple les administrations locales, et/ou les taux de paiement aux prestataires sont-ils le reflet des besoins de santé de la population ?"},null,null,null,null,null,null,null,null,null,{"$f":"IF(Results!G24=TRUE,\"Non pertinent\",IF(Results!F24=\"\",\"Non terminé\",\"Terminé\"))","v":"Non terminé"},null,{"$f":"IF(Results!G24=TRUE,\"Non pertinent\",IF(Results!E24=0,\"Non terminé\",\"Terminé\"))","v":"Non terminé"}]
[]
[]
[null,null,{"$f":"Results!C25&\" \"&Results!D25","v":"Q4.2 Dans quelle mesure les paiements des prestataires sont-ils harmonisés entre régimes/sources de revenus et entre secteurs public et privé, afin de garantir des incitations cohérentes aux prestataires ?"},null,null,null,null,null,null,null,null,null,{"$f":"IF(Results!G25=TRUE,\"Non pertinent\",IF(Results!F25=\"\",\"Non terminé\",\"Terminé\"))","v":"Non terminé"},null,{"$f":"IF(Results!G25=TRUE,\"Non pertinent\",IF(Results!E25=0,\"Non terminé\",\"Terminé\"))","v":"Non terminé"}]
[]
[]
[null,null,{"$f":"Results!C26&\" \"&Results!D26","v":"Q4.3 Dans quelle mesure les méthodes de paiement des prestataires et les achats en général favorisent-ils la qualité des soins et la coordination des soins entre les spécialités et les différents niveaux de soins ?"},null,null,null,null,null,null,null,null,null,{"$f":"IF(Results!G26=TRUE,\"Non pertinent\",IF(Results!F26=\"\",\"Non terminé\",\"Terminé\"))","v":"Non terminé"},null,{"$f":"IF(Results!G26=TRUE,\"Non pertinent\",IF(Results!E26=0,\"Non terminé\",\"Terminé\"))","v":"Non terminé"}]
[]
[]
[null,null,{"$f":"Results!C27&\" \"&Results!D27","v":"Q4.4 Dans quelle mesure les contrats d’achat précisent-ils des exigences en matière de qualité des soins, y compris la disponibilité et la pertinence des soins, puis vérifient-ils de façon régulière qu’elles sont bien respectées ?"},null,null,null,null,null,null,null,null,null,{"$f":"IF(Results!G27=TRUE,\"Non pertinent\",IF(Results!F27=\"\",\"Non terminé\",\"Terminé\"))","v":"Non terminé"},null,{"$f":"IF(Results!G27=TRUE,\"Non pertinent\",IF(Results!E27=0,\"Non terminé\",\"Terminé\"))","v":"Non terminé"}]
[]
[]
[null,null,{"$f":"Results!C28&\" \"&Results!D28","v":"Q4.5 Dans quelle mesure les méthodes de paiement des prestataires favorisent-elles l’efficacité de l’allocation des ressources, par exemple en réduisant la prestation excessive ou en augmentant celle insuffisante des services, et gèrent-elles la croissance des dépenses ?"},null,null,null,null,null,null,null,null,null,{"$f":"IF(Results!G28=TRUE,\"Non pertinent\",IF(Results!F28=\"\",\"Non terminé\",\"Terminé\"))","v":"Non terminé"},null,{"$f":"IF(Results!G28=TRUE,\"Non pertinent\",IF(Results!E28=0,\"Non terminé\",\"Terminé\"))","v":"Non terminé"}]
[]
[]
[null,null,{"$f":"Results!C29&\" \"&Results!D29","v":"Q4.6 Dans quelle mesure les formulaires de consultation des patients sont-ils normalisés dans l'ensemble du système de santé et utilisés pour analyser et évaluer l'activité de l’ensemble des prestataires et de la population "},null,null,null,null,null,null,null,null,null,{"$f":"IF(Results!G29=TRUE,\"Non pertinent\",IF(Results!F29=\"\",\"Non terminé\",\"Terminé\"))","v":"Non terminé"},null,{"$f":"IF(Results!G29=TRUE,\"Non pertinent\",IF(Results!E29=0,\"Non terminé\",\"Terminé\"))","v":"Non terminé"}]
[]
[]
[null,null,{"$f":"Results!C30&\" \"&Results!D30","v":"Q4.7 Dans quelle mesure les paiements des prestataires  couvrent  uniquement une partie ou l’ensemble des coûts totaux (y compris les salaires, les dépenses récurrentes, etc.) ?"},null,null,null,null,null,null,null,null,null,{"$f":"IF(Results!G30=TRUE,\"Non pertinent\",IF(Results!F30=\"\",\"Non terminé\",\"Terminé\"))","v":"Non terminé"},null,{"$f":"IF(Results!G30=TRUE,\"Non pertinent\",IF(Results!E30=0,\"Non terminé\",\"Terminé\"))","v":"Non terminé"}]
[]
[]
[null,null,{"$f":"Results!C31&\" \"&Results!D31","v":"Q4.8 Dans quelle mesure les prestataires jouissent-ils d’une autonomie financière et sont-ils tenus responsables, dans une mesure réaliste et conforme à leurs capacités ?"},null,null,null,null,null,null,null,null,null,{"$f":"IF(Results!G31=TRUE,\"Non pertinent\",IF(Results!F31=\"\",\"Non terminé\",\"Terminé\"))","v":"Non terminé"},null,{"$f":"IF(Results!G31=TRUE,\"Non pertinent\",IF(Results!E31=0,\"Non terminé\",\"Terminé\"))","v":"Non terminé"}]
[]
[]
[null,null,{"$f":"Results!C32&\" \"&Results!D32","v":"Q4.9 Dans quelle mesure l’accréditation des prestataires ou les contrats sélectifs sont-ils établis, fonctionnels et utilisés pour les achats ?"},null,null,null,null,null,null,null,null,null,{"$f":"IF(Results!G32=TRUE,\"Non pertinent\",IF(Results!F32=\"\",\"Non terminé\",\"Terminé\"))","v":"Non terminé"},null,{"$f":"IF(Results!G32=TRUE,\"Non pertinent\",IF(Results!E32=0,\"Non terminé\",\"Terminé\"))","v":"Non terminé"}]
[]
[]
[null,null,{"$f":"Results!C33&\" \"&Results!D33","v":"Q4.10 Dans quelle mesure l’achat et le paiement des produits pharmaceutiques sont-ils mis en œuvre pour promouvoir l’utilisation efficace des médicaments (par exemple le recours aux génériques plutôt qu’aux princeps) et pour améliorer la protection financière des patients ?"},null,null,null,null,null,null,null,null,null,{"$f":"IF(Results!G33=TRUE,\"Non pertinent\",IF(Results!F33=\"\",\"Non terminé\",\"Terminé\"))","v":"Non terminé"},null,{"$f":"IF(Results!G33=TRUE,\"Non pertinent\",IF(Results!E33=0,\"Non terminé\",\"Terminé\"))","v":"Non terminé"}]
[]
[]
[]
[null,null,{"$f":"'Benefits and Entitlements'!D5","v":"5. Prestations et droits"},null,null,null,null,null,null,null,null,null,"Réponse « zone de texte »",null,"Réponse « curseur »"]
[null,null,{"$f":"Results!C34&\" \"&Results!D34","v":"Q5.1 Cette question a été maintenant remplacé par l’étape 1 et le tableau de vue d’ensemble et ne constitue donc plus une question distincte. Merci de bien vous assurer que vous avez complété l’étape 1 car cela vous aidera à remplir les questions de cette section."},null,null,null,null,null,null,null,null,null,"N'est pas applicable"]
[]
[]
[null,null,{"$f":"Results!C35&\" \"&Results!D35","v":"Q5.2 Dans quelle mesure les décisions et les révisions relatives aux prestations sont-elles prises de manière transparente, sur la base d’un processus clairement défini et de critères convenus, tels que le rapport coût-efficacité, la protection financière, l’impact budgétaire ?"},null,null,null,null,null,null,null,null,null,{"$f":"IF(Results!G35=TRUE,\"Non pertinent\",IF(Results!F35=\"\",\"Non terminé\",\"Terminé\"))","v":"Non terminé"},null,{"$f":"IF(Results!G35=TRUE,\"Non pertinent\",IF(Results!E35=0,\"Non terminé\",\"Terminé\"))","v":"Non terminé"}]
[]
[]
[null,null,{"$f":"Results!C36&\" \"&Results!D36","v":"Q5.3 Dans quelle mesure les droits à prestation reflètent-ils explicitement les besoins de santé de la population ?"},null,null,null,null,null,null,null,null,null,{"$f":"IF(Results!G36=TRUE,\"Non pertinent\",IF(Results!F36=\"\",\"Non terminé\",\"Terminé\"))","v":"Non terminé"},null,{"$f":"IF(Results!G36=TRUE,\"Non pertinent\",IF(Results!E36=0,\"Non terminé\",\"Terminé\"))","v":"Non terminé"}]
[]
[]
[null,null,{"$f":"Results!C37&\" \"&Results!D37","v":"Q5.4 Dans quelle mesure les prestations accordent-elles la priorité aux catégories de population prioritaires, par exemple pour une meilleure utilisation des services hautement prioritaires et pour la protection financière ?"},null,null,null,null,null,null,null,null,null,{"$f":"IF(Results!G37=TRUE,\"Non pertinent\",IF(Results!F37=\"\",\"Non terminé\",\"Terminé\"))","v":"Non terminé"},null,{"$f":"IF(Results!G37=TRUE,\"Non pertinent\",IF(Results!E37=0,\"Non terminé\",\"Terminé\"))","v":"Non terminé"}]
[]
[]
[null,null,{"$f":"Results!C38&\" \"&Results!D38","v":"Q5.5 Dans quelle mesure les droits et obligations de la population sont-ils explicitement définis et compris par les intéressés ?"},null,null,null,null,null,null,null,null,null,{"$f":"IF(Results!G38=TRUE,\"Non pertinent\",IF(Results!F38=\"\",\"Non terminé\",\"Terminé\"))","v":"Non terminé"},null,{"$f":"IF(Results!G38=TRUE,\"Non pertinent\",IF(Results!E38=0,\"Non terminé\",\"Terminé\"))","v":"Non terminé"}]
[]
[]
[null,null,{"$f":"Results!C39&\" \"&Results!D39","v":"Q5.6 Dans quelle mesure les prestations sont-elles alignées sur le paiement des prestataires, afin de s’assurer qu’elles sont fournies et que les patients bénéficient d’une protection financière ?"},null,null,null,null,null,null,null,null,null,{"$f":"IF(Results!G39=TRUE,\"Non pertinent\",IF(Results!F39=\"\",\"Non terminé\",\"Terminé\"))","v":"Non terminé"},null,{"$f":"IF(Results!G39=TRUE,\"Non pertinent\",IF(Results!E39=0,\"Non terminé\",\"Terminé\"))","v":"Non terminé"}]
[]
[]
[null,null,{"$f":"Results!C40&\" \"&Results!D40","v":"Q5.7 Dans quelle mesure les prestations, y compris le partage des coûts pour les patients, sont-elles alignées sur les recettes, afin d’assurer un financement adéquat des droits à prestations approuvés ?"},null,null,null,null,null,null,null,null,null,{"$f":"IF(Results!G40=TRUE,\"Non pertinent\",IF(Results!F40=\"\",\"Non terminé\",\"Terminé\"))","v":"Non terminé"},null,{"$f":"IF(Results!G40=TRUE,\"Non pertinent\",IF(Results!E40=0,\"Non terminé\",\"Terminé\"))","v":"Non terminé"}]
[]
[]
[]
[null,null,{"$f":"PFM!D5","v":"6. Gestion des finances publiques (GFP)"},null,null,null,null,null,null,null,null,null,"Réponse « zone de texte »",null,"Réponse « curseur »"]
[null,null,{"$f":"PFM!D8","v":"Q6.1 Est-ce qu’un diagnostic/une évaluation approfondi(e) des goulets d’étranglement de la GFP dans le secteur de la santé a été effectué(e) récemment, par exemple au cours des trois dernières années ?"},null,null,null,null,null,null,null,null,null,{"$f":"IF(Results!G41=TRUE,\"Non pertinent\",IF(Results!F41=\"\",\"Non terminé\",\"Terminé\"))","v":"Non terminé"},null,{"$f":"IF(Results!G41=TRUE,\"Non pertinent\",IF(Results!E41=0,\"Non terminé\",\"Terminé\"))","v":"Non terminé"}]
[]
[]
[null,null,{"$f":"PFM!D24","v":"Q6.2 Le personnel du Ministère de la santé dispose-t-il de capacités à comprendre les (nouvelles) règles de GFP et à les appliquer au processus budgétaire du secteur de la santé ?"},null,null,null,null,null,null,null,null,null,{"$f":"IF(Results!G42=TRUE,\"Non pertinent\",IF(Results!F42=\"\",\"Non terminé\",\"Terminé\"))","v":"Non terminé"},null,{"$f":"IF(Results!G42=TRUE,\"Non pertinent\",IF(Results!E42=0,\"Non terminé\",\"Terminé\"))","v":"Non terminé"}]
[]
[]
[null,null,{"$f":"PFM!D40","v":"Q6.3 Existe-il un processus budgétaire pluriannuel mis en œuvre efficacement ?"},null,null,null,null,null,null,null,null,null,{"$f":"IF(Results!G43=TRUE,\"Non pertinent\",IF(Results!F43=\"\",\"Non terminé\",\"Terminé\"))","v":"Non terminé"},null,{"$f":"IF(Results!G543=TRUE,\"Non pertinent\",IF(Results!E43=0,\"Non terminé\",\"Terminé\"))","v":"Non terminé"}]
[]
[]
[null,null,{"$f":"PFM!D56","v":"Q6.4 Dans quelle mesure les allocations budgétaires annuelles en matière de santé sont alignées sur les priorités du secteur de la santé (niveau, structure, nature/objectif) ?"},null,null,null,null,null,null,null,null,null,{"$f":"IF(Results!G44=TRUE,\"Non pertinent\",IF(Results!F44=\"\",\"Non terminé\",\"Terminé\"))","v":"Non terminé"},null,{"$f":"IF(Results!G44=TRUE,\"Non pertinent\",IF(Results!E44=0,\"Non terminé\",\"Terminé\"))","v":"Non terminé"}]
[]
[]
[null,null,{"$f":"PFM!D72","v":"Q6.5 Dans quelle mesure le processus budgétaire est consultatif, transparent et un processus d’examen et d’ajustement budgétaire à mi-parcours est établi ?"},null,null,null,null,null,null,null,null,null,{"$f":"IF(Results!G45=TRUE,\"Non pertinent\",IF(Results!F45=\"\",\"Non terminé\",\"Terminé\"))","v":"Non terminé"},null,{"$f":"IF(Results!G45=TRUE,\"Non pertinent\",IF(Results!E45=0,\"Non terminé\",\"Terminé\"))","v":"Non terminé"}]
[]
[]
[null,null,{"$f":"PFM!D88","v":"Q6.6 Dans quelle mesure les transferts fiscaux sont conçus et mis en œuvre de sorte à améliorer l’équité de la distribution des ressources dans le secteur de la santé?"},null,null,null,null,null,null,null,null,null,{"$f":"IF(Results!G46=TRUE,\"Non pertinent\",IF(Results!F46=\"\",\"Non terminé\",\"Terminé\"))","v":"Non terminé"},null,{"$f":"IF(Results!G46=TRUE,\"Non pertinent\",IF(Results!E46=0,\"Non terminé\",\"Terminé\"))","v":"Non terminé"}]
[]
[]
[null,null,{"$f":"PFM!D104","v":"Q6.7 Dans quelle mesure les règles du budget de la santé permettent-elles une certaine souplesse des dépenses? "},null,null,null,null,null,null,null,null,null,{"$f":"IF(Results!G47=TRUE,\"Non pertinent\",IF(Results!F47=\"\",\"Non terminé\",\"Terminé\"))","v":"Non terminé"},null,{"$f":"IF(Results!G47=TRUE,\"Non pertinent\",IF(Results!E47=0,\"Non terminé\",\"Terminé\"))","v":"Non terminé"}]
[]
[]
[null,null,{"$f":"PFM!D120","v":"Q6.8 La flexibilité dans l’utilisation des ressources est-elle assurée ou déléguée au bon niveau?"},null,null,null,null,null,null,null,null,null,{"$f":"IF(Results!G48=TRUE,\"Non pertinent\",IF(Results!F48=\"\",\"Non terminé\",\"Terminé\"))","v":"Non terminé"},null,{"$f":"IF(Results!G48=TRUE,\"Non pertinent\",IF(Results!E48=0,\"Non terminé\",\"Terminé\"))","v":"Non terminé"}]
[]
[]
[null,null,{"$f":"PFM!D136","v":"Q6.9 Dans quelle mesure des politiques de discipline budgétaire visant à contrôler les dépenses sont en vigueur (par exemple, gestion de la trésorerie, respect des règles d’approvisionnement) et mises en œuvre efficacement?"},null,null,null,null,null,null,null,null,null,{"$f":"IF(Results!G49=TRUE,\"Non pertinent\",IF(Results!F49=\"\",\"Non terminé\",\"Terminé\"))","v":"Non terminé"},null,{"$f":"IF(Results!G49=TRUE,\"Non pertinent\",IF(Results!E49=0,\"Non terminé\",\"Terminé\"))","v":"Non terminé"}]
[]
[]
[null,null,{"$f":"PFM!D152","v":"Q6.10 Dans quelle mesure des systèmes d’information sont en place pour répondre aux besoins en matière de responsabilité financière et pour assurer le suivi des performances du secteur de la santé?"},null,null,null,null,null,null,null,null,null,{"$f":"IF(Results!G50=TRUE,\"Non pertinent\",IF(Results!F50=\"\",\"Non terminé\",\"Terminé\"))","v":"Non terminé"},null,{"$f":"IF(Results!G50=TRUE,\"Non pertinent\",IF(Results!E50=0,\"Non terminé\",\"Terminé\"))","v":"Non terminé"}]
[]
[]
[null,null,{"$f":"PFM!D168","v":"Q6.11 Dans quelle mesure les flux financiers multiples, la structure budgétaire et les règles de GFP sont alignés sur les politiques d’achats stratégiques?"},null,null,null,null,null,null,null,null,null,{"$f":"IF(Results!G51=TRUE,\"Non pertinent\",IF(Results!F51=\"\",\"Non terminé\",\"Terminé\"))","v":"Non terminé"},null,{"$f":"IF(Results!G51=TRUE,\"Non pertinent\",IF(Results!E51=0,\"Non terminé\",\"Terminé\"))","v":"Non terminé"}]
[]
[]
[]
[null,null,{"$f":"Governance!D5","v":"7. Gouvernance"},null,null,null,null,null,null,null,null,null,"Réponse « zone de texte »",null,"Réponse « curseur »"]
[null,null,{"$f":"Results!C52&\" \"&Results!D52","v":"Q7.1 Dans quelle mesure les rôles et les responsabilités (liés aux objectifs de financement de la santé et au rendement en matière de collecte de recettes, de mise en commun, d’achats, de prestations, etc.) sont clairement définis et répartis entre les institutions responsables du financement de la santé ?"},null,null,null,null,null,null,null,null,null,{"$f":"IF(Results!G52=TRUE,\"Non pertinent\",IF(Results!F52=\"\",\"Non terminé\",\"Terminé\"))","v":"Non terminé"},null,{"$f":"IF(Results!G52=TRUE,\"Non pertinent\",IF(Results!E52=0,\"Non terminé\",\"Terminé\"))","v":"Non terminé"}]
[]
[]
[null,null,{"$f":"Results!C53&\" \"&Results!D53","v":"Q7.2 Dans quelle mesure les institutions responsables du financement de la santé disposent-elles de capacités adéquates, notamment en matière de ressources humaines (capacités techniques et managériales) et de TIC ?"},null,null,null,null,null,null,null,null,null,{"$f":"IF(Results!G53=TRUE,\"Non pertinent\",IF(Results!F53=\"\",\"Non terminé\",\"Terminé\"))","v":"Non terminé"},null,{"$f":"IF(Results!G53=TRUE,\"Non pertinent\",IF(Results!E53=0,\"Non terminé\",\"Terminé\"))","v":"Non terminé"}]
[]
[]
[null,null,{"$f":"Results!C54&\" \"&Results!D54","v":"Q7.3 Dans quelle mesure les mécanismes de responsabilisation des organismes d’achat/de financement (y compris l’autonomie et le conseil d’administration de l’agence d’assurance-maladie, les mécanismes de récompense/sanction, etc.) sont-ils en place pour s’assurer que la politique de financement de la santé appuie les progrès vers les objectifs du secteur et que les fonds sont utilisés efficacement pour les populations, programmes et services prioritaires ?"},null,null,null,null,null,null,null,null,null,{"$f":"IF(Results!G54=TRUE,\"Non pertinent\",IF(Results!F54=\"\",\"Non terminé\",\"Terminé\"))","v":"Non terminé"},null,{"$f":"IF(Results!G54=TRUE,\"Non pertinent\",IF(Results!E54=0,\"Non terminé\",\"Terminé\"))","v":"Non terminé"}]
[]
[]
[null,null,{"$f":"Results!C55&\" \"&Results!D55","v":"Q7.4 L’utilisation des fonds ou les performances des institutions achetant des services auprès des prestataires de services de santé ou le budget de la santé ont-ils été communiqués au public (par exemple sous forme de rapport annuel) ?"},null,null,null,null,null,null,null,null,null,{"$f":"IF(Results!G55=TRUE,\"Non pertinent\",IF(Results!F55=\"\",\"Non terminé\",\"Terminé\"))","v":"Non terminé"},null,{"$f":"IF(Results!G55=TRUE,\"Non pertinent\",IF(Results!E55=0,\"Non terminé\",\"Terminé\"))","v":"Non terminé"}]
[]
[]
[null,null,{"$f":"Results!C56&\" \"&Results!D56","v":"Q7.5 Dans quelle mesure le Ministère des finances, le Ministère de la santé et l’organisme national d’assurance-maladie participent au processus d’élaboration des politiques de financement de la santé et en sont informés ?"},null,null,null,null,null,null,null,null,null,{"$f":"IF(Results!G56=TRUE,\"Non pertinent\",IF(Results!F56=\"\",\"Non terminé\",\"Terminé\"))","v":"Non terminé"},null,{"$f":"IF(Results!G56=TRUE,\"Non pertinent\",IF(Results!E56=0,\"Non terminé\",\"Terminé\"))","v":"Non terminé"}]
[]
[]
[null,null,{"$f":"Results!C57&\" \"&Results!D57","v":"Q7.6 Dans quelle mesure le processus d’élaboration des politiques de financement de la santé est transparent et participatif?"},null,null,null,null,null,null,null,null,null,{"$f":"IF(Results!G57=TRUE,\"Non pertinent\",IF(Results!F57=\"\",\"Non terminé\",\"Terminé\"))","v":"Non terminé"},null,{"$f":"IF(Results!G57=TRUE,\"Non pertinent\",IF(Results!E57=0,\"Non terminé\",\"Terminé\"))","v":"Non terminé"}]

{"sheet":"Etape_1_Resume","index":7,"n_rows":14,"n_cols":9,"rows_kept":14,"cut":false,"hidden":true,"merged":[[2,2,2,5]]}
[1]
[]
[null,null,"APERÇU DES PRINCIPAUX DISPOSITIFS DE COUVERTURE DE SANTÉ DANS VOTRE PAYS"]
[]
[null,null,"CRITERES","SYSTÈME PUBLIC","AUTRE DISPOSTIF DE COUVERTURE (Ajouter nom spéficique dans votre pays)","AUTRE DISPOSTIF DE COUVERTURE (Ajouter nom spéficique dans votre pays)","AUTRE DISPOSTIF DE COUVERTURE (Ajouter nom spéficique dans votre pays)","AUTRE DISPOSTIF DE COUVERTURE (Ajouter nom spéficique dans votre pays)","AUTRE DISPOSTIF DE COUVERTURE (Ajouter nom spéficique dans votre pays)"]
[null,null,"POPULATION CIBLE\nTous les citoyens sont-ils couverts ou un sous-groupe spécifique, par exemple moins de 5 ans, salariés?\n"]
[null,null,"POPULATION COUVERTE / souscrite\nNombre réel relatif à la pop cible.\n"]
[null,null,"BASE DE COUVERTURE / SOUSCRIPTION\nPar exemple. obligatoire, automatique, volontaire\n"]
[null,null,"AVANTAGES / DROITS\nUne liste de services ou niveau de soins est-elle définie? Est-ce que les utilisateurs doivent faire des co-paiements?\n"]
[null,null,"SOURCES DE REVENUS\nD'où vient l'argent? Allocations / transferts budgétaires; contributions prépayées.\n"]
[null,null,"ACCORDS DE MISE EN COMMUN\nLe budget de la santé est-il alloué aux autorités régionales, existe-t-il un ou plusieurs fonds d '«assurance»?\n"]
[null,null,"MODALITES D'ACHAT\nDécrivez les arrangements de gestion et de gouvernance?\n"]
[null,null,"PAIEMENT DU FOURNISSEUR\nPar exemple. les entrées par ligne ou poste budgétaire; Ticket de soins/Service, paiement au cas par cas, capitation, basé sur performances?\n"]
[null,null,"PRESTATION DE SERVICES & CONTRACTUALISATION\nDe quels fournisseurs les services sont-ils achetés? Public-privé? Des contrats / accords de services sont-ils utilisés?\n"]

{"sheet":"Completeness-Obj","index":8,"n_rows":277,"n_cols":15,"rows_kept":277,"cut":false,"hidden":true,"merged":[[2,3,2,14],[276,2,278,11],[276,12,278,13],[276,14,278,15],[270,2,272,11],[270,12,272,13],[270,14,272,15],[273,2,275,11],[273,12,275,13],[273,14,275,15],[264,2,266,11],[264,12,266,13],[264,14,266,15],[267,2,269,11],[267,12,269,13],[267,14,269,15],[258,2,260,11],[258,12,260,13],[258,14,260,15],[261,2,263,11],[261,12,263,13],[261,14,263,15],[249,2,251,11],[249,12,251,13],[249,14,251,15],[255,2,257,11],[255,12,257,13],[255,14,257,15],[243,2,245,11],[243,12,245,13],[243,14,245,15],[246,2,248,11],[246,12,248,13],[246,14,248,15],[252,2,254,11],[252,12,254,13],[252,14,254,15],[223,2,225,11],[223,12,225,13],[223,14,225,15],[240,2,242,11],[240,12,242,13],[240,14,242,15],[217,2,219,11],[217,12,219,13],[217,14,219,15],[220,2,222,11],[220,12,222,13],[220,14,222,15],[237,2,239,11],[237,12,239,13],[237,14,239,15],[208,2,210,11],[208,12,210,13],[208,14,210,15],[194,2,196,11],[194,12,196,13],[194,14,196,15],[198,12,198,13],[198,14,198,15],[199,2,201,11],[199,12,201,13],[199,14,201,15],[202,2,204,11],[202,12,204,13],[202,14,204,15],[150,2,152,11],[150,12,152,13],[150,14,152,15],[173,2,175,11],[173,12,175,13],[173,14,175,15],[156,2,158,11],[156,12,158,13],[156,14,158,15],[153,2,155,11],[153,12,155,13],[153,14,155,15],[160,12,160,13],[160,14,160,15],[164,2,166,11],[164,12,166,13],[161,2,163,11],[161,12,163,13],[144,2,146,11],[144,12,146,13],[144,14,146,15],[147,2,149,11],[147,12,149,13],[147,14,149,15],[234,2,236,11],[234,12,236,13],[234,14,236,15],[227,12,227,13],[227,14,227,15],[228,2,230,11],[228,12,230,13],[228,14,230,15],[231,2,233,11],[231,12,233,13],[231,14,233,15],[164,14,166,15],[167,2,169,11],[167,12,169,13],[167,14,169,15],[170,2,172,11],[170,12,172,13],[170,14,172,15],[81,12,81,13],[81,14,81,15],[91,2,93,11],[91,12,93,13],[91,14,93,15],[106,2,108,11],[127,2,129,11],[127,12,129,13],[127,14,129,15],[121,2,123,11],[121,12,123,13],[121,14,123,15],[124,2,126,11],[124,12,126,13],[124,14,126,15],[115,2,117,11],[115,12,117,13],[115,14,117,15],[118,2,120,11],[118,12,120,13],[118,14,120,15],[106,12,108,13],[106,14,108,15],[42,14,44,15],[56,12,58,13],[56,14,58,15],[59,2,61,11],[59,12,61,13],[49,12,49,13],[49,14,49,15],[50,2,52,11],[50,12,52,13],[50,14,52,15],[53,2,55,11],[53,12,55,13],[36,2,38,11],[36,12,38,13],[36,14,38,15],[39,2,41,11],[39,12,41,13],[39,14,41,15],[59,14,61,15],[77,2,79,11],[77,12,79,13],[77,14,79,15],[74,2,76,11],[74,12,76,13],[74,14,76,15],[71,2,73,11],[71,12,73,13],[71,14,73,15],[45,2,47,11],[45,12,47,13],[45,14,47,15],[65,14,67,15],[53,14,55,15],[56,2,58,11],[42,2,44,11],[42,12,44,13],[214,2,216,11],[214,12,216,13],[214,14,216,15],[88,2,90,11],[88,12,90,13],[88,14,90,15],[33,2,35,11],[33,12,35,13],[33,14,35,15],[138,12,140,13],[138,14,140,15],[97,2,99,11],[97,12,99,13],[97,14,99,15],[131,14,131,15],[132,2,134,11],[132,12,134,13],[132,14,134,15],[94,2,96,11],[94,12,96,13],[94,14,96,15],[100,2,102,11],[100,12,102,13],[100,14,102,15],[211,2,213,11],[211,12,213,13],[211,14,213,15],[176,2,178,11],[176,12,178,13],[176,14,178,15],[179,2,181,11],[179,12,181,13],[179,14,181,15],[188,2,190,11],[188,12,190,13],[188,14,190,15],[191,2,193,11],[191,12,193,13],[191,14,193,15],[182,2,184,11],[182,12,184,13],[182,14,184,15],[185,2,187,11],[185,12,187,13],[185,14,187,15],[205,2,207,11],[205,12,207,13],[205,14,207,15],[18,12,20,13],[18,14,20,15],[62,2,64,11],[62,12,64,13],[62,14,64,15],[161,14,163,15],[24,2,26,11],[24,12,26,13],[24,14,26,15],[68,2,70,11],[68,12,70,13],[68,14,70,15],[27,2,29,11],[27,12,29,13],[27,14,29,15],[30,2,32,11],[30,12,32,13],[30,14,32,15],[109,2,111,11],[109,12,111,13],[141,2,143,11],[141,12,143,13],[141,14,143,15],[138,2,140,11],[135,14,137,15],[85,2,87,11],[85,12,87,13],[85,14,87,15],[109,14,111,15],[131,12,131,13],[112,12,114,13],[112,14,114,15],[103,2,105,11],[103,12,105,13],[103,14,105,15],[112,2,114,11],[135,2,137,11],[135,12,137,13],[5,12,5,13],[5,14,5,15],[82,2,84,11],[82,12,84,13],[82,14,84,15],[3,2,3,15],[6,2,8,11],[6,12,8,13],[6,14,8,15],[12,2,14,11],[12,12,14,13],[12,14,14,15],[15,2,17,11],[15,12,17,13],[15,14,17,15],[9,2,11,11],[9,12,11,13],[9,14,11,15],[21,2,23,11],[21,12,23,13],[21,14,23,15],[65,2,67,11],[65,12,67,13],[18,2,20,11]]}
[1]
[]
[null,null,null,"MATRICE DE PROGRÈS POUR LE FINANCEMENT DE LA SANTÉ"]
[null,null,"Quel est l’état d’avancement de votre évaluation ?"]
[]
[null,null,"Efficience",null,null,null,null,null,null,null,null,null,"Réponse « zone de texte »",null,"Réponse « curseur »"]
[null,null,{"$f":"Results!C15&\" \"&Results!D15","v":"Q2.4 Dans quelle mesure le flux de fonds publics est-il stable, notamment grâce à une exécution budgétaire régulière, c’est-à-dire un déblocage des fonds dans les délais, conformément aux budgets de santé approuvés ?"},null,null,null,null,null,null,null,null,null,{"$f":"IF(Results!G15=TRUE,\"Non pertinent\",IF(Results!F15=\"\",\"Non terminé\",\"Terminé\"))","v":"Non terminé"},null,{"$f":"IF(Results!G15=TRUE,\"Non pertinent\",IF(Results!E15=0,\"Non terminé\",\"Terminé\"))","v":"Non terminé"}]
[]
[]
[null,null,{"$f":"Results!C18&\" \"&Results!D18","v":"Q3.2 Dans le cadre du processus global d’élaboration et de planification de la mise en œuvre des politiques de financement de la santé, quelle est l’approche de votre pays en matière de dispositifs de mise en commun des ressources ?"},null,null,null,null,null,null,null,null,null,{"$f":"IF(Results!G18=TRUE,\"Non pertinent\",IF(Results!F18=\"\",\"Non terminé\",\"Terminé\"))","v":"Non terminé"},null,{"$f":"IF(Results!G18=TRUE,\"Non pertinent\",IF(Results!E18=0,\"Non terminé\",\"Terminé\"))","v":"Non terminé"}]
[]
[]
[null,null,{"$f":"Results!C19&\" \"&Results!D19","v":"Q3.3 Dans quelle mesure la capacité de redistribution des fonds prépayés dans votre pays est-elle limitée par le cadre institutionnel du financement de la santé ?"},null,null,null,null,null,null,null,null,null,{"$f":"IF(Results!G19=TRUE,\"Non pertinent\",IF(Results!F19=\"\",\"Non terminé\",\"Terminé\"))","v":"Non terminé"},null,{"$f":"IF(Results!G19=TRUE,\"Non pertinent\",IF(Results!E19=0,\"Non terminé\",\"Terminé\"))","v":"Non terminé"}]
[]
[]
[null,null,{"$f":"Results!C20&\" \"&Results!D20","v":"Q3.4 Y-a-il des mesures, dans la conception des prestations, le paiement des prestataires ou les systèmes sous-jacents non financiers, qui visent à contrecarrer les problèmes découlant de la fragmentation de l’architecture du financement de la santé ?"},null,null,null,null,null,null,null,null,null,{"$f":"IF(Results!G20=TRUE,\"Non pertinent\",IF(Results!F20=\"\",\"Non terminé\",\"Terminé\"))","v":"Non terminé"},null,{"$f":"IF(Results!G20=TRUE,\"Non pertinent\",IF(Results!E20=0,\"Non terminé\",\"Terminé\"))","v":"Non terminé"}]
[]
[]
[null,null,{"$f":"Results!C21&\" \"&Results!D21","v":"Q3.5 Dans quelle mesure les différentes sources de revenus et de financement sont-elles organisées de manière complémentaire, afin de financer un paquet de prestations pour l’ensemble de la population ?"},null,null,null,null,null,null,null,null,null,{"$f":"IF(Results!G21=TRUE,\"Non pertinent\",IF(Results!F21=\"\",\"Non terminé\",\"Terminé\"))","v":"Non terminé"},null,{"$f":"IF(Results!G21=TRUE,\"Non pertinent\",IF(Results!E21=0,\"Non terminé\",\"Terminé\"))","v":"Non terminé"}]
[]
[]
[null,null,{"$f":"Results!C23&\" \"&Results!D23","v":"Q3.7 Dans quelle mesure les flux financiers sont-ils incohérents et redondants, et empêchent d’utiliser efficacement le budget public et les fonds des donateurs ?"},null,null,null,null,null,null,null,null,null,{"$f":"IF(Results!G23=TRUE,\"Non pertinent\",IF(Results!F23=\"\",\"Non terminé\",\"Terminé\"))","v":"Non terminé"},null,{"$f":"IF(Results!G23=TRUE,\"Non pertinent\",IF(Results!E23=0,\"Non terminé\",\"Terminé\"))","v":"Non terminé"}]
[]
[]
[null,null,{"$f":"Results!C28&\" \"&Results!D28","v":"Q4.5 Dans quelle mesure les méthodes de paiement des prestataires favorisent-elles l’efficacité de l’allocation des ressources, par exemple en réduisant la prestation excessive ou en augmentant celle insuffisante des services, et gèrent-elles la croissance des dépenses ?"},null,null,null,null,null,null,null,null,null,{"$f":"IF(Results!G28=TRUE,\"Non pertinent\",IF(Results!F28=\"\",\"Non terminé\",\"Terminé\"))","v":"Non terminé"},null,{"$f":"IF(Results!G28=TRUE,\"Non pertinent\",IF(Results!E28=0,\"Non terminé\",\"Terminé\"))","v":"Non terminé"}]
[]
[]
[null,null,{"$f":"Results!C31&\" \"&Results!D31","v":"Q4.8 Dans quelle mesure les prestataires jouissent-ils d’une autonomie financière et sont-ils tenus responsables, dans une mesure réaliste et conforme à leurs capacités ?"},null,null,null,null,null,null,null,null,null,{"$f":"IF(Results!G31=TRUE,\"Non pertinent\",IF(Results!F31=\"\",\"Non terminé\",\"Terminé\"))","v":"Non terminé"},null,{"$f":"IF(Results!G31=TRUE,\"Non pertinent\",IF(Results!E31=0,\"Non terminé\",\"Terminé\"))","v":"Non terminé"}]
[]
[]
[null,null,{"$f":"Results!C32&\" \"&Results!D32","v":"Q4.9 Dans quelle mesure l’accréditation des prestataires ou les contrats sélectifs sont-ils établis, fonctionnels et utilisés pour les achats ?"},null,null,null,null,null,null,null,null,null,{"$f":"IF(Results!G32=TRUE,\"Non pertinent\",IF(Results!F32=\"\",\"Non terminé\",\"Terminé\"))","v":"Non terminé"},null,{"$f":"IF(Results!G32=TRUE,\"Non pertinent\",IF(Results!E32=0,\"Non terminé\",\"Terminé\"))","v":"Non terminé"}]
[]
[]
[null,null,{"$f":"Results!C33&\" \"&Results!D33","v":"Q4.10 Dans quelle mesure l’achat et le paiement des produits pharmaceutiques sont-ils mis en œuvre pour promouvoir l’utilisation efficace des médicaments (par exemple le recours aux génériques plutôt qu’aux princeps) et pour améliorer la protection financière des patients ?"},null,null,null,null,null,null,null,null,null,{"$f":"IF(Results!G33=TRUE,\"Non pertinent\",IF(Results!F33=\"\",\"Non terminé\",\"Terminé\"))","v":"Non terminé"},null,{"$f":"IF(Results!G33=TRUE,\"Non pertinent\",IF(Results!E33=0,\"Non terminé\",\"Terminé\"))","v":"Non terminé"}]
[]
[]
[null,null,{"$f":"PFM!D104","v":"Q6.7 Dans quelle mesure les règles du budget de la santé permettent-elles une certaine souplesse des dépenses? "},null,null,null,null,null,null,null,null,null,{"$f":"IF(Results!G47=TRUE,\"Non pertinent\",IF(Results!F47=\"\",\"Non terminé\",\"Terminé\"))","v":"Non terminé"},null,{"$f":"IF(Results!G47=TRUE,\"Non pertinent\",IF(Results!E47=0,\"Non terminé\",\"Terminé\"))","v":"Non terminé"}]
[]
[]
[null,null,{"$f":"PFM!D120","v":"Q6.8 La flexibilité dans l’utilisation des ressources est-elle assurée ou déléguée au bon niveau?"},null,null,null,null,null,null,null,null,null,{"$f":"IF(Results!G48=TRUE,\"Non pertinent\",IF(Results!F48=\"\",\"Non terminé\",\"Terminé\"))","v":"Non terminé"},null,{"$f":"IF(Results!G48=TRUE,\"Non pertinent\",IF(Results!E48=0,\"Non terminé\",\"Terminé\"))","v":"Non terminé"}]
[]
[]
[null,null,{"$f":"PFM!D136","v":"Q6.9 Dans quelle mesure des politiques de discipline budgétaire visant à contrôler les dépenses sont en vigueur (par exemple, gestion de la trésorerie, respect des règles d’approvisionnement) et mises en œuvre efficacement?"},null,null,null,null,null,null,null,null,null,{"$f":"IF(Results!G49=TRUE,\"Non pertinent\",IF(Results!F49=\"\",\"Non terminé\",\"Terminé\"))","v":"Non terminé"},null,{"$f":"IF(Results!G49=TRUE,\"Non pertinent\",IF(Results!E49=0,\"Non terminé\",\"Terminé\"))","v":"Non terminé"}]
[]
[]
[null,null,{"$f":"PFM!D168","v":"Q6.11 Dans quelle mesure les flux financiers multiples, la structure budgétaire et les règles de GFP sont alignés sur les politiques d’achats stratégiques?"},null,null,null,null,null,null,null,null,null,{"$f":"IF(Results!G51=TRUE,\"Non pertinent\",IF(Results!F51=\"\",\"Non terminé\",\"Terminé\"))","v":"Non terminé"},null,{"$f":"IF(Results!G51=TRUE,\"Non pertinent\",IF(Results!E51=0,\"Non terminé\",\"Terminé\"))","v":"Non terminé"}]
[]
[]
[]
[null,null,"Équité dans la distribution des ressources",null,null,null,null,null,null,null,null,null,"Text box response",null,"Slider response"]
[null,null,{"$f":"C10","v":"Q3.2 Dans le cadre du processus global d’élaboration et de planification de la mise en œuvre des politiques de financement de la santé, quelle est l’approche de votre pays en matière de dispositifs de mise en commun des ressources ?"},null,null,null,null,null,null,null,null,null,{"$f":"M10","v":"Non terminé"},null,{"$f":"O10","v":"Non terminé"}]
[]
[]
[null,null,{"$f":"C13","v":"Q3.3 Dans quelle mesure la capacité de redistribution des fonds prépayés dans votre pays est-elle limitée par le cadre institutionnel du financement de la santé ?"},null,null,null,null,null,null,null,null,null,{"$f":"M13","v":"Non terminé"},null,{"$f":"O13","v":"Non terminé"}]
[]
[]
[null,null,{"$f":"C16","v":"Q3.4 Y-a-il des mesures, dans la conception des prestations, le paiement des prestataires ou les systèmes sous-jacents non financiers, qui visent à contrecarrer les problèmes découlant de la fragmentation de l’architecture du financement de la santé ?"},null,null,null,null,null,null,null,null,null,{"$f":"M16","v":"Non terminé"},null,{"$f":"O16","v":"Non terminé"}]
[]
[]
[null,null,{"$f":"C19","v":"Q3.5 Dans quelle mesure les différentes sources de revenus et de financement sont-elles organisées de manière complémentaire, afin de financer un paquet de prestations pour l’ensemble de la population ?"},null,null,null,null,null,null,null,null,null,{"$f":"M19","v":"Non terminé"},null,{"$f":"O19","v":"Non terminé"}]
[]
[]
[null,null,{"$f":"Results!C22&\" \"&Results!D22","v":"Q3.6 Dans quelle mesure les dispositifs d’assurance-maladie volontaire sont-ils une source d’inégalités, créant des effets de contagion potentiellement néfastes pour l’ensemble du système de santé ?"},null,null,null,null,null,null,null,null,null,{"$f":"IF(Results!G22=TRUE,\"Non pertinent\",IF(Results!F22=\"\",\"Non terminé\",\"Terminé\"))","v":"Non terminé"},null,{"$f":"IF(Results!G22=TRUE,\"Non pertinent\",IF(Results!E22=0,\"Non terminé\",\"Terminé\"))","v":"Non terminé"}]
[]
[]
[null,null,{"$f":"Results!C24&\" \"&Results!D24","v":"Q4.1 Dans quelle mesure les allocations de fonds aux acheteurs de niveau inférieur, par exemple les administrations locales, et/ou les taux de paiement aux prestataires sont-ils le reflet des besoins de santé de la population ?"},null,null,null,null,null,null,null,null,null,{"$f":"IF(Results!G24=TRUE,\"Non pertinent\",IF(Results!F24=\"\",\"Non terminé\",\"Terminé\"))","v":"Non terminé"},null,{"$f":"IF(Results!G24=TRUE,\"Non pertinent\",IF(Results!E24=0,\"Non terminé\",\"Terminé\"))","v":"Non terminé"}]
[]
[]
[null,null,{"$f":"Results!C25&\" \"&Results!D25","v":"Q4.2 Dans quelle mesure les paiements des prestataires sont-ils harmonisés entre régimes/sources de revenus et entre secteurs public et privé, afin de garantir des incitations cohérentes aux prestataires ?"},null,null,null,null,null,null,null,null,null,{"$f":"IF(Results!G25=TRUE,\"Non pertinent\",IF(Results!F25=\"\",\"Non terminé\",\"Terminé\"))","v":"Non terminé"},null,{"$f":"IF(Results!G25=TRUE,\"Non pertinent\",IF(Results!E25=0,\"Non terminé\",\"Terminé\"))","v":"Non terminé"}]
[]
[]
[null,null,{"$f":"PFM!D56","v":"Q6.4 Dans quelle mesure les allocations budgétaires annuelles en matière de santé sont alignées sur les priorités du secteur de la santé (niveau, structure, nature/objectif) ?"},null,null,null,null,null,null,null,null,null,{"$f":"IF(Results!G44=TRUE,\"Non pertinent\",IF(Results!F44=\"\",\"Non terminé\",\"Terminé\"))","v":"Non terminé"},null,{"$f":"IF(Results!G44=TRUE,\"Non pertinent\",IF(Results!E44=0,\"Non terminé\",\"Terminé\"))","v":"Non terminé"}]
[]
[]
[null,null,{"$f":"PFM!D88","v":"Q6.6 Dans quelle mesure les transferts fiscaux sont conçus et mis en œuvre de sorte à améliorer l’équité de la distribution des ressources dans le secteur de la santé?"},null,null,null,null,null,null,null,null,null,{"$f":"IF(Results!G46=TRUE,\"Non pertinent\",IF(Results!F46=\"\",\"Non terminé\",\"Terminé\"))","v":"Non terminé"},null,{"$f":"IF(Results!G46=TRUE,\"Non pertinent\",IF(Results!E46=0,\"Non terminé\",\"Terminé\"))","v":"Non terminé"}]
[]
[]
[null,null,{"$f":"C46","v":"Q6.11 Dans quelle mesure les flux financiers multiples, la structure budgétaire et les règles de GFP sont alignés sur les politiques d’achats stratégiques?"},null,null,null,null,null,null,null,null,null,{"$f":"M46","v":"Non terminé"},null,{"$f":"O46","v":"Non terminé"}]
[]
[]
[]
[null,null,"Transparence et responsabilité",null,null,null,null,null,null,null,null,null,"Text box response",null,"Slider response"]
[null,null,{"$f":"Results!C12&\" \"&Results!D12","v":"Q2.1 Quelle approche est en vigueur dans votre pays en matière d’élaboration de politiques et de stratégies de collecte de revenus ? Cette approche s'inscrit-elle dans le cadre du processus global d’élaboration et de planification de la mise en œuvre des politiques de financement de la santé ?"},null,null,null,null,null,null,null,null,null,{"$f":"IF(Results!G12=TRUE,\"Non pertinent\",IF(Results!F12=\"\",\"Non terminé\",\"Terminé\"))","v":"Non terminé"},null,{"$f":"IF(Results!G12=TRUE,\"Non pertinent\",IF(Results!E12=0,\"Non terminé\",\"Terminé\"))","v":"Non terminé"}]
[]
[]
[null,null,{"$f":"Results!C14&\" \"&Results!D14","v":"Q2.3 Dans quelle mesure le financement public de la santé dans votre pays est-il prédictible sur plusieurs années ?"},null,null,null,null,null,null,null,null,null,{"$f":"IF(Results!G14=TRUE,\"Non pertinent\",IF(Results!F14=\"\",\"Non terminé\",\"Terminé\"))","v":"Non terminé"},null,{"$f":"IF(Results!G14=TRUE,\"Non pertinent\",IF(Results!E14=0,\"Non terminé\",\"Terminé\"))","v":"Non terminé"}]
[]
[]
[null,null,{"$f":"Results!C27&\" \"&Results!D27","v":"Q4.4 Dans quelle mesure les contrats d’achat précisent-ils des exigences en matière de qualité des soins, y compris la disponibilité et la pertinence des soins, puis vérifient-ils de façon régulière qu’elles sont bien respectées ?"},null,null,null,null,null,null,null,null,null,{"$f":"IF(Results!G27=TRUE,\"Non pertinent\",IF(Results!F27=\"\",\"Non terminé\",\"Terminé\"))","v":"Non terminé"},null,{"$f":"IF(Results!G27=TRUE,\"Non pertinent\",IF(Results!E27=0,\"Non terminé\",\"Terminé\"))","v":"Non terminé"}]
[]
[]
[null,null,{"$f":"C28","v":"Q4.8 Dans quelle mesure les prestataires jouissent-ils d’une autonomie financière et sont-ils tenus responsables, dans une mesure réaliste et conforme à leurs capacités ?"},null,null,null,null,null,null,null,null,null,{"$f":"M28","v":"Non terminé"},null,{"$f":"O28","v":"Non terminé"}]
[]
[]
[null,null,{"$f":"Results!C35&\" \"&Results!D35","v":"Q5.2 Dans quelle mesure les décisions et les révisions relatives aux prestations sont-elles prises de manière transparente, sur la base d’un processus clairement défini et de critères convenus, tels que le rapport coût-efficacité, la protection financière, l’impact budgétaire ?"},null,null,null,null,null,null,null,null,null,{"$f":"IF(Results!G35=TRUE,\"Non pertinent\",IF(Results!F35=\"\",\"Non terminé\",\"Terminé\"))","v":"Non terminé"},null,{"$f":"IF(Results!G35=TRUE,\"Non pertinent\",IF(Results!E35=0,\"Non terminé\",\"Terminé\"))","v":"Non terminé"}]
[]
[]
[null,null,{"$f":"Results!C38&\" \"&Results!D38","v":"Q5.5 Dans quelle mesure les droits et obligations de la population sont-ils explicitement définis et compris par les intéressés ?"},null,null,null,null,null,null,null,null,null,{"$f":"IF(Results!G38=TRUE,\"Non pertinent\",IF(Results!F38=\"\",\"Non terminé\",\"Terminé\"))","v":"Non terminé"},null,{"$f":"IF(Results!G38=TRUE,\"Non pertinent\",IF(Results!E38=0,\"Non terminé\",\"Terminé\"))","v":"Non terminé"}]
[]
[]
[null,null,{"$f":"Results!C40&\" \"&Results!D40","v":"Q5.7 Dans quelle mesure les prestations, y compris le partage des coûts pour les patients, sont-elles alignées sur les recettes, afin d’assurer un financement adéquat des droits à prestations approuvés ?"},null,null,null,null,null,null,null,null,null,{"$f":"IF(Results!G40=TRUE,\"Non pertinent\",IF(Results!F40=\"\",\"Non terminé\",\"Terminé\"))","v":"Non terminé"},null,{"$f":"IF(Results!G40=TRUE,\"Non pertinent\",IF(Results!E40=0,\"Non terminé\",\"Terminé\"))","v":"Non terminé"}]
[]
[]
[null,null,{"$f":"PFM!D72","v":"Q6.5 Dans quelle mesure le processus budgétaire est consultatif, transparent et un processus d’examen et d’ajustement budgétaire à mi-parcours est établi ?"},null,null,null,null,null,null,null,null,null,{"$f":"IF(Results!G45=TRUE,\"Non pertinent\",IF(Results!F45=\"\",\"Non terminé\",\"Terminé\"))","v":"Non terminé"},null,{"$f":"IF(Results!G45=TRUE,\"Non pertinent\",IF(Results!E45=0,\"Non terminé\",\"Terminé\"))","v":"Non terminé"}]
[]
[]
[null,null,{"$f":"C37","v":"Q6.7 Dans quelle mesure les règles du budget de la santé permettent-elles une certaine souplesse des dépenses? "},null,null,null,null,null,null,null,null,null,{"$f":"M37","v":"Non terminé"},null,{"$f":"O37","v":"Non terminé"}]
[]
[]
[null,null,{"$f":"C43","v":"Q6.9 Dans quelle mesure des politiques de discipline budgétaire visant à contrôler les dépenses sont en vigueur (par exemple, gestion de la trésorerie, respect des règles d’approvisionnement) et mises en œuvre efficacement?"},null,null,null,null,null,null,null,null,null,{"$f":"M43","v":"Non terminé"},null,{"$f":"O43","v":"Non terminé"}]
[]
[]
[null,null,{"$f":"Results!C52&\" \"&Results!D52","v":"Q7.1 Dans quelle mesure les rôles et les responsabilités (liés aux objectifs de financement de la santé et au rendement en matière de collecte de recettes, de mise en commun, d’achats, de prestations, etc.) sont clairement définis et répartis entre les institutions responsables du financement de la santé ?"},null,null,null,null,null,null,null,null,null,{"$f":"IF(Results!G52=TRUE,\"Non pertinent\",IF(Results!F52=\"\",\"Non terminé\",\"Terminé\"))","v":"Non terminé"},null,{"$f":"IF(Results!G52=TRUE,\"Non pertinent\",IF(Results!E52=0,\"Non terminé\",\"Terminé\"))","v":"Non terminé"}]
[]
[]
[null,null,{"$f":"Results!C53&\" \"&Results!D53","v":"Q7.2 Dans quelle mesure les institutions responsables du financement de la santé disposent-elles de capacités adéquates, notamment en matière de ressources humaines (capacités techniques et managériales) et de TIC ?"},null,null,null,null,null,null,null,null,null,{"$f":"IF(Results!G53=TRUE,\"Non pertinent\",IF(Results!F53=\"\",\"Non terminé\",\"Terminé\"))","v":"Non terminé"},null,{"$f":"IF(Results!G53=TRUE,\"Non pertinent\",IF(Results!E53=0,\"Non terminé\",\"Terminé\"))","v":"Non terminé"}]
[]
[]
[null,null,{"$f":"Results!C54&\" \"&Results!D54","v":"Q7.3 Dans quelle mesure les mécanismes de responsabilisation des organismes d’achat/de financement (y compris l’autonomie et le conseil d’administration de l’agence d’assurance-maladie, les mécanismes de récompense/sanction, etc.) sont-ils en place pour s’assurer que la politique de financement de la santé appuie les progrès vers les objectifs du secteur et que les fonds sont utilisés efficacement pour les populations, programmes et services prioritaires ?"},null,null,null,null,null,null,null,null,null,{"$f":"IF(Results!G54=TRUE,\"Non pertinent\",IF(Results!F54=\"\",\"Non terminé\",\"Terminé\"))","v":"Non terminé"},null,{"$f":"IF(Results!G54=TRUE,\"Non pertinent\",IF(Results!E54=0,\"Non terminé\",\"Terminé\"))","v":"Non terminé"}]
[]
[]
[null,null,{"$f":"Results!C55&\" \"&Results!D55","v":"Q7.4 L’utilisation des fonds ou les performances des institutions achetant des services auprès des prestataires de services de santé ou le budget de la santé ont-ils été communiqués au public (par exemple sous forme de rapport annuel) ?"},null,null,null,null,null,null,null,null,null,{"$f":"IF(Results!G55=TRUE,\"Non pertinent\",IF(Results!F55=\"\",\"Non terminé\",\"Terminé\"))","v":"Non terminé"},null,{"$f":"IF(Results!G55=TRUE,\"Non pertinent\",IF(Results!E55=0,\"Non terminé\",\"Terminé\"))","v":"Non terminé"}]
[]
[]
[null,null,{"$f":"Results!C56&\" \"&Results!D56","v":"Q7.5 Dans quelle mesure le Ministère des finances, le Ministère de la santé et l’organisme national d’assurance-maladie participent au processus d’élaboration des politiques de financement de la santé et en sont informés ?"},null,null,null,null,null,null,null,null,null,{"$f":"IF(Results!G56=TRUE,\"Non pertinent\",IF(Results!F56=\"\",\"Non terminé\",\"Terminé\"))","v":"Non terminé"},null,{"$f":"IF(Results!G56=TRUE,\"Non pertinent\",IF(Results!E56=0,\"Non terminé\",\"Terminé\"))","v":"Non terminé"}]
[]
[]
[null,null,{"$f":"Results!C57&\" \"&Results!D57","v":"Q7.6 Dans quelle mesure le processus d’élaboration des politiques de financement de la santé est transparent et participatif?"},null,null,null,null,null,null,null,null,null,{"$f":"IF(Results!G57=TRUE,\"Non pertinent\",IF(Results!F57=\"\",\"Non terminé\",\"Terminé\"))","v":"Non terminé"},null,{"$f":"IF(Results!G57=TRUE,\"Non pertinent\",IF(Results!E57=0,\"Non terminé\",\"Terminé\"))","v":"Non terminé"}]
[]
[]
[]
[null,null,"Équité des financements",null,null,null,null,null,null,null,null,null,"Text box response",null,"Slider response"]
[null,null,{"$f":"C83","v":"Q2.1 Quelle approche est en vigueur dans votre pays en matière d’élaboration de politiques et de stratégies de collecte de revenus ? Cette approche s'inscrit-elle dans le cadre du processus global d’élaboration et de planification de la mise en œuvre des politiques de financement de la santé ?"},null,null,null,null,null,null,null,null,null,{"$f":"M83","v":"Non terminé"},null,{"$f":"O83","v":"Non terminé"}]
[]
[]
[null,null,{"$f":"Results!C13&\" \"&Results!D13","v":"Q2.2 Dans quelle mesure le financement de la santé dans votre pays repose-t-il sur des sources de financement public/obligatoire (par exemple, fiscalité/recettes publiques, y compris les cotisations obligatoires à l’assurance-maladie nationale/sociale) ?"},null,null,null,null,null,null,null,null,null,{"$f":"IF(Results!G13=TRUE,\"Non pertinent\",IF(Results!F13=\"\",\"Non terminé\",\"Terminé\"))","v":"Non terminé"},null,{"$f":"IF(Results!G13=TRUE,\"Non pertinent\",IF(Results!E13=0,\"Non terminé\",\"Terminé\"))","v":"Non terminé"}]
[]
[]
[null,null,{"$f":"C7","v":"Q2.4 Dans quelle mesure le flux de fonds publics est-il stable, notamment grâce à une exécution budgétaire régulière, c’est-à-dire un déblocage des fonds dans les délais, conformément aux budgets de santé approuvés ?"},null,null,null,null,null,null,null,null,null,{"$f":"M7","v":"Non terminé"},null,{"$f":"O7","v":"Non terminé"}]
[]
[]
[null,null,{"$f":"Results!C16&\" \"&Results!D16","v":"Q2.5 Dans quelle mesure les différentes sources de revenus sont-elles collectées de façon progressive (c.-à-d. en fonction de la capacité de payer), et partant de là favorisent l’équité dans le mode de financement du système de santé ?"},null,null,null,null,null,null,null,null,null,{"$f":"IF(Results!G16=TRUE,\"Non pertinent\",IF(Results!F16=\"\",\"Non terminé\",\"Terminé\"))","v":"Non terminé"},null,{"$f":"IF(Results!G16=TRUE,\"Non pertinent\",IF(Results!E16=0,\"Non terminé\",\"Terminé\"))","v":"Non terminé"}]
[]
[]
[null,null,{"$f":"C57","v":"Q3.4 Y-a-il des mesures, dans la conception des prestations, le paiement des prestataires ou les systèmes sous-jacents non financiers, qui visent à contrecarrer les problèmes découlant de la fragmentation de l’architecture du financement de la santé ?"},null,null,null,null,null,null,null,null,null,{"$f":"M57","v":"Non terminé"},null,{"$f":"O57","v":"Non terminé"}]
[]
[]
[null,null,{"$f":"C63","v":"Q3.6 Dans quelle mesure les dispositifs d’assurance-maladie volontaire sont-ils une source d’inégalités, créant des effets de contagion potentiellement néfastes pour l’ensemble du système de santé ?"},null,null,null,null,null,null,null,null,null,{"$f":"M63","v":"Non terminé"},null,{"$f":"O63","v":"Non terminé"}]
[]
[]
[null,null,{"$f":"C34","v":"Q4.10 Dans quelle mesure l’achat et le paiement des produits pharmaceutiques sont-ils mis en œuvre pour promouvoir l’utilisation efficace des médicaments (par exemple le recours aux génériques plutôt qu’aux princeps) et pour améliorer la protection financière des patients ?"},null,null,null,null,null,null,null,null,null,{"$f":"M34","v":"Non terminé"},null,{"$f":"O34","v":"Non terminé"}]
[]
[]
[null,null,{"$f":"Results!C37&\" \"&Results!D37","v":"Q5.4 Dans quelle mesure les prestations accordent-elles la priorité aux catégories de population prioritaires, par exemple pour une meilleure utilisation des services hautement prioritaires et pour la protection financière ?"},null,null,null,null,null,null,null,null,null,{"$f":"IF(Results!G37=TRUE,\"Non pertinent\",IF(Results!F37=\"\",\"Non terminé\",\"Terminé\"))","v":"Non terminé"},null,{"$f":"IF(Results!G37=TRUE,\"Non pertinent\",IF(Results!E37=0,\"Non terminé\",\"Terminé\"))","v":"Non terminé"}]
[]
[]
[null,null,{"$f":"Results!C39&\" \"&Results!D39","v":"Q5.6 Dans quelle mesure les prestations sont-elles alignées sur le paiement des prestataires, afin de s’assurer qu’elles sont fournies et que les patients bénéficient d’une protection financière ?"},null,null,null,null,null,null,null,null,null,{"$f":"IF(Results!G39=TRUE,\"Non pertinent\",IF(Results!F39=\"\",\"Non terminé\",\"Terminé\"))","v":"Non terminé"},null,{"$f":"IF(Results!G39=TRUE,\"Non pertinent\",IF(Results!E39=0,\"Non terminé\",\"Terminé\"))","v":"Non terminé"}]
[]
[]
[]
[null,null,"Protection financière ",null,null,null,null,null,null,null,null,null,"Text box response",null,"Slider response"]
[null,null,{"$f":"C133","v":"Q2.1 Quelle approche est en vigueur dans votre pays en matière d’élaboration de politiques et de stratégies de collecte de revenus ? Cette approche s'inscrit-elle dans le cadre du processus global d’élaboration et de planification de la mise en œuvre des politiques de financement de la santé ?"},null,null,null,null,null,null,null,null,null,{"$f":"M133","v":"Non terminé"},null,{"$f":"O133","v":"Non terminé"}]
[]
[]
[null,null,{"$f":"C136","v":"Q2.2 Dans quelle mesure le financement de la santé dans votre pays repose-t-il sur des sources de financement public/obligatoire (par exemple, fiscalité/recettes publiques, y compris les cotisations obligatoires à l’assurance-maladie nationale/sociale) ?"},null,null,null,null,null,null,null,null,null,{"$f":"M136","v":"Non terminé"},null,{"$f":"O136","v":"Non terminé"}]
[]
[]
[null,null,{"$f":"C139","v":"Q2.4 Dans quelle mesure le flux de fonds publics est-il stable, notamment grâce à une exécution budgétaire régulière, c’est-à-dire un déblocage des fonds dans les délais, conformément aux budgets de santé approuvés ?"},null,null,null,null,null,null,null,null,null,{"$f":"M139","v":"Non terminé"},null,{"$f":"O139","v":"Non terminé"}]
[]
[]
[null,null,{"$f":"C142","v":"Q2.5 Dans quelle mesure les différentes sources de revenus sont-elles collectées de façon progressive (c.-à-d. en fonction de la capacité de payer), et partant de là favorisent l’équité dans le mode de financement du système de santé ?"},null,null,null,null,null,null,null,null,null,{"$f":"M142","v":"Non terminé"},null,{"$f":"O142","v":"Non terminé"}]
[]
[]
[null,null,{"$f":"C51","v":"Q3.2 Dans le cadre du processus global d’élaboration et de planification de la mise en œuvre des politiques de financement de la santé, quelle est l’approche de votre pays en matière de dispositifs de mise en commun des ressources ?"},null,null,null,null,null,null,null,null,null,{"$f":"M51","v":"Non terminé"},null,{"$f":"O51","v":"Non terminé"}]
[]
[]
[null,null,{"$f":"C54","v":"Q3.3 Dans quelle mesure la capacité de redistribution des fonds prépayés dans votre pays est-elle limitée par le cadre institutionnel du financement de la santé ?"},null,null,null,null,null,null,null,null,null,{"$f":"M54","v":"Non terminé"},null,{"$f":"O54","v":"Non terminé"}]
[]
[]
[null,null,{"$f":"C57","v":"Q3.4 Y-a-il des mesures, dans la conception des prestations, le paiement des prestataires ou les systèmes sous-jacents non financiers, qui visent à contrecarrer les problèmes découlant de la fragmentation de l’architecture du financement de la santé ?"},null,null,null,null,null,null,null,null,null,{"$f":"M57","v":"Non terminé"},null,{"$f":"O57","v":"Non terminé"}]
[]
[]
[null,null,{"$f":"C60","v":"Q3.5 Dans quelle mesure les différentes sources de revenus et de financement sont-elles organisées de manière complémentaire, afin de financer un paquet de prestations pour l’ensemble de la population ?"},null,null,null,null,null,null,null,null,null,{"$f":"M60","v":"Non terminé"},null,{"$f":"O60","v":"Non terminé"}]
[]
[]
[null,null,{"$f":"C63","v":"Q3.6 Dans quelle mesure les dispositifs d’assurance-maladie volontaire sont-ils une source d’inégalités, créant des effets de contagion potentiellement néfastes pour l’ensemble du système de santé ?"},null,null,null,null,null,null,null,null,null,{"$f":"M63","v":"Non terminé"},null,{"$f":"O63","v":"Non terminé"}]
[]
[]
[null,null,{"$f":"C151","v":"Q4.10 Dans quelle mesure l’achat et le paiement des produits pharmaceutiques sont-ils mis en œuvre pour promouvoir l’utilisation efficace des médicaments (par exemple le recours aux génériques plutôt qu’aux princeps) et pour améliorer la protection financière des patients ?"},null,null,null,null,null,null,null,null,null,{"$f":"M151","v":"Non terminé"},null,{"$f":"O151","v":"Non terminé"}]
[]
[]
[null,null,{"$f":"C154","v":"Q5.4 Dans quelle mesure les prestations accordent-elles la priorité aux catégories de population prioritaires, par exemple pour une meilleure utilisation des services hautement prioritaires et pour la protection financière ?"},null,null,null,null,null,null,null,null,null,{"$f":"M154","v":"Non terminé"},null,{"$f":"O154","v":"Non terminé"}]
[]
[]
[null,null,{"$f":"C157","v":"Q5.6 Dans quelle mesure les prestations sont-elles alignées sur le paiement des prestataires, afin de s’assurer qu’elles sont fournies et que les patients bénéficient d’une protection financière ?"},null,null,null,null,null,null,null,null,null,{"$f":"M157","v":"Non terminé"},null,{"$f":"O157","v":"Non terminé"}]
[]
[]
[]
[null,null,"Qualité",null,null,null,null,null,null,null,null,null,"Text box response",null,"Slider response"]
[null,null,{"$f":"C69","v":"Q4.2 Dans quelle mesure les paiements des prestataires sont-ils harmonisés entre régimes/sources de revenus et entre secteurs public et privé, afin de garantir des incitations cohérentes aux prestataires ?"},null,null,null,null,null,null,null,null,null,{"$f":"M69","v":"Non terminé"},null,{"$f":"O69","v":"Non terminé"}]
[]
[]
[null,null,{"$f":"Results!C26&\" \"&Results!D26","v":"Q4.3 Dans quelle mesure les méthodes de paiement des prestataires et les achats en général favorisent-ils la qualité des soins et la coordination des soins entre les spécialités et les différents niveaux de soins ?"},null,null,null,null,null,null,null,null,null,{"$f":"IF(Results!G26=TRUE,\"Non pertinent\",IF(Results!F26=\"\",\"Non terminé\",\"Terminé\"))","v":"Non terminé"},null,{"$f":"IF(Results!G26=TRUE,\"Non pertinent\",IF(Results!E26=0,\"Non terminé\",\"Terminé\"))","v":"Non terminé"}]
[]
[]
[null,null,{"$f":"C89","v":"Q4.4 Dans quelle mesure les contrats d’achat précisent-ils des exigences en matière de qualité des soins, y compris la disponibilité et la pertinence des soins, puis vérifient-ils de façon régulière qu’elles sont bien respectées ?"},null,null,null,null,null,null,null,null,null,{"$f":"M89","v":"Non terminé"},null,{"$f":"O89","v":"Non terminé"}]
[]
[]
[null,null,{"$f":"C25","v":"Q4.5 Dans quelle mesure les méthodes de paiement des prestataires favorisent-elles l’efficacité de l’allocation des ressources, par exemple en réduisant la prestation excessive ou en augmentant celle insuffisante des services, et gèrent-elles la croissance des dépenses ?"},null,null,null,null,null,null,null,null,null,{"$f":"M25","v":"Non terminé"},null,{"$f":"O25","v":"Non terminé"}]
[]
[]
[null,null,{"$f":"Results!C29&\" \"&Results!D29","v":"Q4.6 Dans quelle mesure les formulaires de consultation des patients sont-ils normalisés dans l'ensemble du système de santé et utilisés pour analyser et évaluer l'activité de l’ensemble des prestataires et de la population "},null,null,null,null,null,null,null,null,null,{"$f":"IF(Results!G29=TRUE,\"Non pertinent\",IF(Results!F29=\"\",\"Non terminé\",\"Terminé\"))","v":"Non terminé"},null,{"$f":"IF(Results!G29=TRUE,\"Non pertinent\",IF(Results!E29=0,\"Non terminé\",\"Terminé\"))","v":"Non terminé"}]
[]
[]
[null,null,{"$f":"Results!C30&\" \"&Results!D30","v":"Q4.7 Dans quelle mesure les paiements des prestataires  couvrent  uniquement une partie ou l’ensemble des coûts totaux (y compris les salaires, les dépenses récurrentes, etc.) ?"},null,null,null,null,null,null,null,null,null,{"$f":"IF(Results!G30=TRUE,\"Non pertinent\",IF(Results!F30=\"\",\"Non terminé\",\"Terminé\"))","v":"Non terminé"},null,{"$f":"IF(Results!G30=TRUE,\"Non pertinent\",IF(Results!E30=0,\"Non terminé\",\"Terminé\"))","v":"Non terminé"}]
[]
[]
[null,null,{"$f":"C28","v":"Q4.8 Dans quelle mesure les prestataires jouissent-ils d’une autonomie financière et sont-ils tenus responsables, dans une mesure réaliste et conforme à leurs capacités ?"},null,null,null,null,null,null,null,null,null,{"$f":"M28","v":"Non terminé"},null,{"$f":"O28","v":"Non terminé"}]
[]
[]
[null,null,{"$f":"C31","v":"Q4.9 Dans quelle mesure l’accréditation des prestataires ou les contrats sélectifs sont-ils établis, fonctionnels et utilisés pour les achats ?"},null,null,null,null,null,null,null,null,null,{"$f":"M31","v":"Non terminé"},null,{"$f":"O31","v":"Non terminé"}]
[]
[]
[null,null,{"$f":"C116","v":"Q7.2 Dans quelle mesure les institutions responsables du financement de la santé disposent-elles de capacités adéquates, notamment en matière de ressources humaines (capacités techniques et managériales) et de TIC ?"},null,null,null,null,null,null,null,null,null,{"$f":"M116","v":"Non terminé"},null,{"$f":"O116","v":"Non terminé"}]
[]
[]
[]
[null,null,"Utilisation par rapport aux besoins",null,null,null,null,null,null,null,null,null,"Text box response",null,"Slider response"]
[null,null,{"$f":"C86","v":"Q2.3 Dans quelle mesure le financement public de la santé dans votre pays est-il prédictible sur plusieurs années ?"},null,null,null,null,null,null,null,null,null,{"$f":"M86","v":"Non terminé"},null,{"$f":"O86","v":"Non terminé"}]
[]
[]
[null,null,{"$f":"C168","v":"Q2.4 Dans quelle mesure le flux de fonds publics est-il stable, notamment grâce à une exécution budgétaire régulière, c’est-à-dire un déblocage des fonds dans les délais, conformément aux budgets de santé approuvés ?"},null,null,null,null,null,null,null,null,null,{"$f":"M168","v":"Non terminé"},null,{"$f":"O168","v":"Non terminé"}]
[]
[]
[null,null,{"$f":"C171","v":"Q2.5 Dans quelle mesure les différentes sources de revenus sont-elles collectées de façon progressive (c.-à-d. en fonction de la capacité de payer), et partant de là favorisent l’équité dans le mode de financement du système de santé ?"},null,null,null,null,null,null,null,null,null,{"$f":"M171","v":"Non terminé"},null,{"$f":"O171","v":"Non terminé"}]
[]
[]
[null,null,{"$f":"C10","v":"Q3.2 Dans le cadre du processus global d’élaboration et de planification de la mise en œuvre des politiques de financement de la santé, quelle est l’approche de votre pays en matière de dispositifs de mise en commun des ressources ?"},null,null,null,null,null,null,null,null,null,{"$f":"M10","v":"Non terminé"},null,{"$f":"O10","v":"Non terminé"}]
[]
[]
[null,null,{"$f":"C13","v":"Q3.3 Dans quelle mesure la capacité de redistribution des fonds prépayés dans votre pays est-elle limitée par le cadre institutionnel du financement de la santé ?"},null,null,null,null,null,null,null,null,null,{"$f":"M13","v":"Non terminé"},null,{"$f":"O13","v":"Non terminé"}]
[]
[]
[null,null,{"$f":"C16","v":"Q3.4 Y-a-il des mesures, dans la conception des prestations, le paiement des prestataires ou les systèmes sous-jacents non financiers, qui visent à contrecarrer les problèmes découlant de la fragmentation de l’architecture du financement de la santé ?"},null,null,null,null,null,null,null,null,null,{"$f":"M16","v":"Non terminé"},null,{"$f":"O16","v":"Non terminé"}]
[]
[]
[null,null,{"$f":"C19","v":"Q3.5 Dans quelle mesure les différentes sources de revenus et de financement sont-elles organisées de manière complémentaire, afin de financer un paquet de prestations pour l’ensemble de la population ?"},null,null,null,null,null,null,null,null,null,{"$f":"M19","v":"Non terminé"},null,{"$f":"O19","v":"Non terminé"}]
[]
[]
[null,null,{"$f":"C66","v":"Q4.1 Dans quelle mesure les allocations de fonds aux acheteurs de niveau inférieur, par exemple les administrations locales, et/ou les taux de paiement aux prestataires sont-ils le reflet des besoins de santé de la population ?"},null,null,null,null,null,null,null,null,null,{"$f":"M66","v":"Non terminé"},null,{"$f":"O66","v":"Non terminé"}]
[]
[]
[null,null,{"$f":"Results!C36&\" \"&Results!D36","v":"Q5.3 Dans quelle mesure les droits à prestation reflètent-ils explicitement les besoins de santé de la population ?"},null,null,null,null,null,null,null,null,null,{"$f":"IF(Results!G36=TRUE,\"Non pertinent\",IF(Results!F36=\"\",\"Non terminé\",\"Terminé\"))","v":"Non terminé"},null,{"$f":"IF(Results!G36=TRUE,\"Non pertinent\",IF(Results!E36=0,\"Non terminé\",\"Terminé\"))","v":"Non terminé"}]
[]
[]
[null,null,{"$f":"C192","v":"Q5.4 Dans quelle mesure les prestations accordent-elles la priorité aux catégories de population prioritaires, par exemple pour une meilleure utilisation des services hautement prioritaires et pour la protection financière ?"},null,null,null,null,null,null,null,null,null,{"$f":"M192","v":"Non terminé"},null,{"$f":"O192","v":"Non terminé"}]
[]
[]
[null,null,{"$f":"C98","v":"Q5.5 Dans quelle mesure les droits et obligations de la population sont-ils explicitement définis et compris par les intéressés ?"},null,null,null,null,null,null,null,null,null,{"$f":"M98","v":"Non terminé"},null,{"$f":"O98","v":"Non terminé"}]
[]
[]
[null,null,{"$f":"C195","v":"Q5.6 Dans quelle mesure les prestations sont-elles alignées sur le paiement des prestataires, afin de s’assurer qu’elles sont fournies et que les patients bénéficient d’une protection financière ?"},null,null,null,null,null,null,null,null,null,{"$f":"M195","v":"Non terminé"},null,{"$f":"O195","v":"Non terminé"}]
[]
[]
[null,null,{"$f":"C101","v":"Q5.7 Dans quelle mesure les prestations, y compris le partage des coûts pour les patients, sont-elles alignées sur les recettes, afin d’assurer un financement adéquat des droits à prestations approuvés ?"},null,null,null,null,null,null,null,null,null,{"$f":"M101","v":"Non terminé"},null,{"$f":"O101","v":"Non terminé"}]
[]
[]
[null,null,{"$f":"C72","v":"Q6.4 Dans quelle mesure les allocations budgétaires annuelles en matière de santé sont alignées sur les priorités du secteur de la santé (niveau, structure, nature/objectif) ?"},null,null,null,null,null,null,null,null,null,{"$f":"M72","v":"Non terminé"},null,{"$f":"O72","v":"Non terminé"}]
[]
[]
[null,null,{"$f":"C75","v":"Q6.6 Dans quelle mesure les transferts fiscaux sont conçus et mis en œuvre de sorte à améliorer l’équité de la distribution des ressources dans le secteur de la santé?"},null,null,null,null,null,null,null,null,null,{"$f":"M75","v":"Non terminé"},null,{"$f":"O75","v":"Non terminé"}]
[]
[]
[null,null,{"$f":"C107","v":"Q6.7 Dans quelle mesure les règles du budget de la santé permettent-elles une certaine souplesse des dépenses? "},null,null,null,null,null,null,null,null,null,{"$f":"M107","v":"Non terminé"},null,{"$f":"O107","v":"Non terminé"}]
[]
[]
[null,null,{"$f":"C78","v":"Q6.11 Dans quelle mesure les flux financiers multiples, la structure budgétaire et les règles de GFP sont alignés sur les politiques d’achats stratégiques?"},null,null,null,null,null,null,null,null,null,{"$f":"M78","v":"Non terminé"},null,{"$f":"O78","v":"Non terminé"}]

{"sheet":"Check","index":9,"n_rows":14,"n_cols":9,"rows_kept":14,"cut":false,"hidden":true,"merged":[[4,2,4,15]]}
[1]
[]
[null,null,"Vérifiez l'exhaustivité"]
[]
[null,null,"Choisir"]
[]
[]
[]
[]
[]
[]
[]
[]
[null,null,null,null,null,null,null,null,"© Organisation Mondiale de la Santé 2019. Tous les droits sont réservés."]

{"sheet":"Assessment-check","index":10,"n_rows":14,"n_cols":9,"rows_kept":14,"cut":false,"hidden":true,"merged":[[4,2,4,15]]}
[1]
[]
[null,null,"Résumé de votre évaluation"]
[]
[null,null,"Choisir"]
[]
[]
[]
[]
[]
[]
[]
[]
[null,null,null,null,null,null,null,null,"© Organisation Mondiale de la Santé 2019. Tous les droits sont réservés."]

{"sheet":"Your Assessment-Obj","index":11,"n_rows":75,"n_cols":8,"rows_kept":75,"cut":false,"hidden":true,"merged":[[70,2,72,5],[74,2,76,5],[54,2,56,5],[50,2,52,5],[26,2,28,5],[30,2,32,5],[34,2,36,5],[38,2,40,5],[42,2,44,5],[46,2,48,5],[58,2,60,5],[62,2,64,5],[66,2,68,5],[3,2,3,13],[10,2,12,5],[14,2,16,5],[18,2,20,5],[22,2,24,5],[5,6,5,12],[5,3,5,5],[8,2,8,3]]}
[" "]
[]
[null,null,null,"MATRICE DE PROGRÈS POUR LE FINANCEMENT DE LA SANTÉ"]
[null,null,"RÉSUMÉ DE VOTRE ÉVALUATION"]
[null,null,null,"↓"]
[null,null,"Cliquez sur la zone de texte pour sélectionner une matrice","Équité dans la distribution des ressources",null,null,"Votre évaluation"]
[null,null,"Questions",null,null,null,null," "]
[]
[null,null,{"$f":"Results!P21","v":"Équité dans la distribution des ressources"}]
[]
[null,null,{"$f":"Results!S20","v":"3.2. Dans le cadre du processus global d’élaboration et de planification de la mise en œuvre des politiques de financement de la santé, quelle est l’approche de votre pays en matière de dispositifs de mise en commun des ressources ?"}]
[]
[]
[]
[null,null,{"$f":"Results!S21","v":"3.3. Dans quelle mesure la capacité de redistribution des fonds prépayés dans votre pays est-elle limitée par le cadre institutionnel du financement de la santé ?"}]
[]
[]
[]
[null,null,{"$f":"Results!S22","v":"3.4. Y-a-il des mesures, dans la conception des prestations, le paiement des prestataires ou les systèmes sous-jacents non financiers, qui visent à contrecarrer les problèmes découlant de la fragmentation de l’architecture du financement de la santé ?"}]
[]
[]
[]
[null,null,{"$f":"Results!S23","v":"3.5. Dans quelle mesure les différentes sources de revenus et de financement sont-elles organisées de manière complémentaire, afin de financer un paquet de prestations pour l’ensemble de la population ?"}]
[]
[]
[]
[null,null,{"$f":"Results!S24","v":"3.6. Dans quelle mesure les dispositifs d’assurance-maladie volontaire sont-ils une source d’inégalités, créant des effets de contagion potentiellement néfastes pour l’ensemble du système de santé ?"}]
[]
[]
[]
[null,null,{"$f":"Results!S25","v":"4.1. Dans quelle mesure les allocations de fonds aux acheteurs de niveau inférieur, par exemple les administrations locales, et/ou les taux de paiement aux prestataires sont-ils le reflet des besoins de santé de la population ?"}]
[]
[]
[]
[null,null,{"$f":"Results!S26","v":"4.2. Dans quelle mesure les paiements des prestataires sont-ils harmonisés entre régimes/sources de revenus et entre secteurs public et privé, afin de garantir des incitations cohérentes aux prestataires ?"}]
[]
[]
[]
[null,null,{"$f":"Results!S27","v":"6.4. Dans quelle mesure les allocations budgétaires annuelles en matière de santé sont alignées sur les priorités du secteur de la santé (niveau, structure, nature/objectif) ?"}]
[]
[]
[]
[null,null,{"$f":"Results!S28","v":"6.6. Dans quelle mesure les transferts fiscaux sont conçus et mis en œuvre de sorte à améliorer l’équité de la distribution des ressources dans le secteur de la santé?"}]
[]
[]
[]
[null,null,{"$f":"Results!S29","v":"6,11. Dans quelle mesure les flux financiers multiples, la structure budgétaire et les règles de GFP sont alignés sur les politiques d’achats stratégiques?"}]
[]
[]
[]
[null,null,{"$f":"Results!S30","v":""}]
[]
[]
[]
[null,null,{"$f":"Results!S31","v":""}]
[]
[]
[]
[null,null,{"$f":"Results!S32","v":""}]
[]
[]
[]
[null,null,{"$f":"Results!S33","v":""}]
[]
[]
[]
[null,null,{"$f":"Results!S34","v":""}]
[]
[]
[]
[null,null,{"$f":"Results!S35","v":""}]
[]
[]
[]
[null,null,{"$f":"Results!S36","v":""}]

{"sheet":"Print_option","index":12,"n_rows":14,"n_cols":9,"rows_kept":14,"cut":false,"hidden":true,"merged":[[4,2,4,15]]}
[1]
[]
[null,null,"Imprimez vos résultats"]
[]
[null,null,"Imprimé par"]
[]
[]
[]
[]
[]
[]
[]
[]
[null,null,null,null,null,null,null,null,"© Organisation Mondiale de la Santé 2019. Tous les droits sont réservés."]

{"sheet":"Dataset","index":13,"n_rows":191,"n_cols":14,"rows_kept":191,"cut":false,"hidden":true,"merged":[]}
["Country_Name","ISO_Code","WHO region","income","Completed_by","Process followed:","Period_from","Period_to","Question_required","Function_Objective","Question_code","Question_description","Result_text","score_number"]
[{"$f":"Results!$B$2","v":0},{"$f":"code","v":""},{"$f":"Results!$G$4","v":{"$error":"#N/A"}},{"$f":"Results!G5","v":{"$error":"#N/A"}},{"$f":"Results!$B$6","v":0},null,{"$f":"CONCATENATE(Results!$C$4,\" - \",Results!$B$4)","v":"0 - 0"},{"$f":"CONCATENATE(Results!$C$5,\" - \",Results!$B$5)","v":"0 - 0"},{"$f":"Results!G8","v":false},"Policy development process",{"$f":"Results!C8","v":"Q1.1"},{"$f":"Results!D8","v":"Le système de financement de la santé de votre pays a-t-il récemment fait l’objet d’un diagnostic ou d’une évaluation approfondie qui examine son impact sur les performances du système de santé ainsi que les causes des problèmes de performance ?"},{"$f":"Results!F8","v":""},{"$f":"Q1.1","v":0}]
[{"$f":"Results!$B$2","v":0},"",{"$f":"C2","v":{"$error":"#N/A"}},{"$f":"D2","v":{"$error":"#N/A"}},{"$f":"Results!$B$6","v":0},null,{"$f":"CONCATENATE(Results!$C$4,\" - \",Results!$B$4)","v":"0 - 0"},{"$f":"CONCATENATE(Results!$C$5,\" - \",Results!$B$5)","v":"0 - 0"},{"$f":"Results!G9","v":false},"Policy development process",{"$f":"Results!C9","v":"Q1.2"},{"$f":"Results!D9","v":"A-t-on transposé en textes de loi/décrets une déclaration de politique récente relative au financement de la santé ?"},{"$f":"Results!F9","v":""},{"$f":"Q1.2","v":0}]
[{"$f":"Results!$B$2","v":0},"",{"$f":"C3","v":{"$error":"#N/A"}},{"$f":"D3","v":{"$error":"#N/A"}},{"$f":"Results!$B$6","v":0},null,{"$f":"CONCATENATE(Results!$C$4,\" - \",Results!$B$4)","v":"0 - 0"},{"$f":"CONCATENATE(Results!$C$5,\" - \",Results!$B$5)","v":"0 - 0"},{"$f":"Results!G10","v":false},"Policy development process",{"$f":"Results!C10","v":"Q1.3"},{"$f":"Results!D10","v":"Existe-t-il un système de suivi régulier du financement de la santé, et si oui les données sont-elles utilisées pour suivre les progrès effectués (par exemple sur les modèles de dépenses et la protection financière) et pour renforcer la reddition de comptes ?"},{"$f":"Results!F10","v":""},{"$f":"Q1.3","v":0}]
[{"$f":"Results!$B$2","v":0},"",{"$error":"#N/A"},{"$error":"#N/A"},{"$f":"Results!$B$6","v":0},null,{"$f":"CONCATENATE(Results!$C$4,\" - \",Results!$B$4)","v":"0 - 0"},{"$f":"CONCATENATE(Results!$C$5,\" - \",Results!$B$5)","v":"0 - 0"},{"$f":"Results!G11","v":false},"Policy development process",{"$f":"Results!C11","v":"Q1.4"},{"$f":"Results!D11","v":"Les études d’évaluation sont-elles réalisées sur une base systématique pour mesurer les conséquences de la mise en œuvre de réformes spécifiques du financement sur les objectifs du système de santé et dans quelles mesure les résultats servent-ils à guider la conception et la révision des politiques de financement de la santé ?"},{"$f":"Results!F11","v":""},{"$f":"Q1.4","v":0}]
[{"$f":"Results!$B$2","v":0},"",{"$error":"#N/A"},{"$error":"#N/A"},{"$f":"Results!$B$6","v":0},null,{"$f":"CONCATENATE(Results!$C$4,\" - \",Results!$B$4)","v":"0 - 0"},{"$f":"CONCATENATE(Results!$C$5,\" - \",Results!$B$5)","v":"0 - 0"},{"$f":"Results!G12","v":false},"Revenue raising",{"$f":"Results!C12","v":"Q2.1"},{"$f":"Results!D12","v":"Quelle approche est en vigueur dans votre pays en matière d’élaboration de politiques et de stratégies de collecte de revenus ? Cette approche s'inscrit-elle dans le cadre du processus global d’élaboration et de planification de la mise en œuvre des politiques de financement de la santé ?"},{"$f":"Results!F12","v":""},{"$f":"Q2.1","v":0}]
[{"$f":"Results!$B$2","v":0},"",{"$error":"#N/A"},{"$error":"#N/A"},{"$f":"Results!$B$6","v":0},null,{"$f":"CONCATENATE(Results!$C$4,\" - \",Results!$B$4)","v":"0 - 0"},{"$f":"CONCATENATE(Results!$C$5,\" - \",Results!$B$5)","v":"0 - 0"},{"$f":"Results!G13","v":false},"Revenue raising",{"$f":"Results!C13","v":"Q2.2"},{"$f":"Results!D13","v":"Dans quelle mesure le financement de la santé dans votre pays repose-t-il sur des sources de financement public/obligatoire (par exemple, fiscalité/recettes publiques, y compris les cotisations obligatoires à l’assurance-maladie nationale/sociale) ?"},{"$f":"Results!F13","v":""},{"$f":"Q2.2","v":0}]
[{"$f":"Results!$B$2","v":0},"",{"$error":"#N/A"},{"$error":"#N/A"},{"$f":"Results!$B$6","v":0},null,{"$f":"CONCATENATE(Results!$C$4,\" - \",Results!$B$4)","v":"0 - 0"},{"$f":"CONCATENATE(Results!$C$5,\" - \",Results!$B$5)","v":"0 - 0"},{"$f":"Results!G14","v":false},"Revenue raising",{"$f":"Results!C14","v":"Q2.3"},{"$f":"Results!D14","v":"Dans quelle mesure le financement public de la santé dans votre pays est-il prédictible sur plusieurs années ?"},{"$f":"Results!F14","v":""},{"$f":"Q2.3","v":0}]
[{"$f":"Results!$B$2","v":0},"",{"$error":"#N/A"},{"$error":"#N/A"},{"$f":"Results!$B$6","v":0},null,{"$f":"CONCATENATE(Results!$C$4,\" - \",Results!$B$4)","v":"0 - 0"},{"$f":"CONCATENATE(Results!$C$5,\" - \",Results!$B$5)","v":"0 - 0"},{"$f":"Results!G15","v":false},"Revenue raising",{"$f":"Results!C15","v":"Q2.4"},{"$f":"Results!D15","v":"Dans quelle mesure le flux de fonds publics est-il stable, notamment grâce à une exécution budgétaire régulière, c’est-à-dire un déblocage des fonds dans les délais, conformément aux budgets de santé approuvés ?"},{"$f":"Results!F15","v":""},{"$f":"Q2.4","v":0}]
[{"$f":"Results!$B$2","v":0},"",{"$error":"#N/A"},{"$error":"#N/A"},{"$f":"Results!$B$6","v":0},null,{"$f":"CONCATENATE(Results!$C$4,\" - \",Results!$B$4)","v":"0 - 0"},{"$f":"CONCATENATE(Results!$C$5,\" - \",Results!$B$5)","v":"0 - 0"},{"$f":"Results!G16","v":false},"Revenue raising",{"$f":"Results!C16","v":"Q2.5"},{"$f":"Results!D16","v":"Dans quelle mesure les différentes sources de revenus sont-elles collectées de façon progressive (c.-à-d. en fonction de la capacité de payer), et partant de là favorisent l’équité dans le mode de financement du système de santé ?"},{"$f":"Results!F16","v":""},{"$f":"Q2.5","v":0}]
[{"$f":"Results!$B$2","v":0},"",{"$error":"#N/A"},{"$error":"#N/A"},{"$f":"Results!$B$6","v":0},null,{"$f":"CONCATENATE(Results!$C$4,\" - \",Results!$B$4)","v":"0 - 0"},{"$f":"CONCATENATE(Results!$C$5,\" - \",Results!$B$5)","v":"0 - 0"},{"$f":"Results!G17","v":false},"other",{"$f":"Results!C17","v":"Q3.1"},{"$f":"Results!D17","v":"Cette question a été maintenant remplacé par l’étape 1 et le tableau de vue d’ensemble et ne constitue donc plus une question distincte. Merci de bien vous assurer que vous avez complété l’étape 1 car cela vous aidera à remplir les questions de cette section."},{"$f":"Results!F17","v":""},{"$f":"Q3.1","v":0}]
[{"$f":"Results!$B$2","v":0},"",{"$error":"#N/A"},{"$error":"#N/A"},{"$f":"Results!$B$6","v":0},null,{"$f":"CONCATENATE(Results!$C$4,\" - \",Results!$B$4)","v":"0 - 0"},{"$f":"CONCATENATE(Results!$C$5,\" - \",Results!$B$5)","v":"0 - 0"},{"$f":"Results!G18","v":false},"Pooling",{"$f":"Results!C18","v":"Q3.2"},{"$f":"Results!D18","v":"Dans le cadre du processus global d’élaboration et de planification de la mise en œuvre des politiques de financement de la santé, quelle est l’approche de votre pays en matière de dispositifs de mise en commun des ressources ?"},{"$f":"Results!F18","v":""},{"$f":"Q3.2","v":0}]
[{"$f":"Results!$B$2","v":0},"",{"$error":"#N/A"},{"$error":"#N/A"},{"$f":"Results!$B$6","v":0},null,{"$f":"CONCATENATE(Results!$C$4,\" - \",Results!$B$4)","v":"0 - 0"},{"$f":"CONCATENATE(Results!$C$5,\" - \",Results!$B$5)","v":"0 - 0"},{"$f":"Results!G19","v":false},"Pooling",{"$f":"Results!C19","v":"Q3.3"},{"$f":"Results!D19","v":"Dans quelle mesure la capacité de redistribution des fonds prépayés dans votre pays est-elle limitée par le cadre institutionnel du financement de la santé ?"},{"$f":"Results!F19","v":""},{"$f":"Q3.3","v":0}]
[{"$f":"Results!$B$2","v":0},"",{"$error":"#N/A"},{"$error":"#N/A"},{"$f":"Results!$B$6","v":0},null,{"$f":"CONCATENATE(Results!$C$4,\" - \",Results!$B$4)","v":"0 - 0"},{"$f":"CONCATENATE(Results!$C$5,\" - \",Results!$B$5)","v":"0 - 0"},{"$f":"Results!G20","v":false},"Pooling",{"$f":"Results!C20","v":"Q3.4"},{"$f":"Results!D20","v":"Y-a-il des mesures, dans la conception des prestations, le paiement des prestataires ou les systèmes sous-jacents non financiers, qui visent à contrecarrer les problèmes découlant de la fragmentation de l’architecture du financement de la santé ?"},{"$f":"Results!F20","v":""},{"$f":"Q3.4","v":0}]
[{"$f":"Results!$B$2","v":0},"",{"$error":"#N/A"},{"$error":"#N/A"},{"$f":"Results!$B$6","v":0},null,{"$f":"CONCATENATE(Results!$C$4,\" - \",Results!$B$4)","v":"0 - 0"},{"$f":"CONCATENATE(Results!$C$5,\" - \",Results!$B$5)","v":"0 - 0"},{"$f":"Results!G21","v":false},"Pooling",{"$f":"Results!C21","v":"Q3.5"},{"$f":"Results!D21","v":"Dans quelle mesure les différentes sources de revenus et de financement sont-elles organisées de manière complémentaire, afin de financer un paquet de prestations pour l’ensemble de la population ?"},{"$f":"Results!F21","v":""},{"$f":"Q3.5","v":0}]
[{"$f":"Results!$B$2","v":0},"",{"$error":"#N/A"},{"$error":"#N/A"},{"$f":"Results!$B$6","v":0},null,{"$f":"CONCATENATE(Results!$C$4,\" - \",Results!$B$4)","v":"0 - 0"},{"$f":"CONCATENATE(Results!$C$5,\" - \",Results!$B$5)","v":"0 - 0"},{"$f":"Results!G22","v":false},"Pooling",{"$f":"Results!C22","v":"Q3.6"},{"$f":"Results!D22","v":"Dans quelle mesure les dispositifs d’assurance-maladie volontaire sont-ils une source d’inégalités, créant des effets de contagion potentiellement néfastes pour l’ensemble du système de santé ?"},{"$f":"Results!F22","v":""},{"$f":"Q3.6","v":0}]
[{"$f":"Results!$B$2","v":0},"",{"$error":"#N/A"},{"$error":"#N/A"},{"$f":"Results!$B$6","v":0},null,{"$f":"CONCATENATE(Results!$C$4,\" - \",Results!$B$4)","v":"0 - 0"},{"$f":"CONCATENATE(Results!$C$5,\" - \",Results!$B$5)","v":"0 - 0"},{"$f":"Results!G23","v":false},"Pooling",{"$f":"Results!C23","v":"Q3.7"},{"$f":"Results!D23","v":"Dans quelle mesure les flux financiers sont-ils incohérents et redondants, et empêchent d’utiliser efficacement le budget public et les fonds des donateurs ?"},{"$f":"Results!F23","v":""},{"$f":"Q3.7","v":0}]
[{"$f":"Results!$B$2","v":0},"",{"$error":"#N/A"},{"$error":"#N/A"},{"$f":"Results!$B$6","v":0},null,{"$f":"CONCATENATE(Results!$C$4,\" - \",Results!$B$4)","v":"0 - 0"},{"$f":"CONCATENATE(Results!$C$5,\" - \",Results!$B$5)","v":"0 - 0"},{"$f":"Results!G24","v":false},"Purchasing",{"$f":"Results!C24","v":"Q4.1"},{"$f":"Results!D24","v":"Dans quelle mesure les allocations de fonds aux acheteurs de niveau inférieur, par exemple les administrations locales, et/ou les taux de paiement aux prestataires sont-ils le reflet des besoins de santé de la population ?"},{"$f":"Results!F24","v":""},{"$f":"Q4.1","v":0}]
[{"$f":"Results!$B$2","v":0},"",{"$error":"#N/A"},{"$error":"#N/A"},{"$f":"Results!$B$6","v":0},null,{"$f":"CONCATENATE(Results!$C$4,\" - \",Results!$B$4)","v":"0 - 0"},{"$f":"CONCATENATE(Results!$C$5,\" - \",Results!$B$5)","v":"0 - 0"},{"$f":"Results!G25","v":false},"Purchasing",{"$f":"Results!C25","v":"Q4.2"},{"$f":"Results!D25","v":"Dans quelle mesure les paiements des prestataires sont-ils harmonisés entre régimes/sources de revenus et entre secteurs public et privé, afin de garantir des incitations cohérentes aux prestataires ?"},{"$f":"Results!F25","v":""},{"$f":"Q4.2","v":0}]
[{"$f":"Results!$B$2","v":0},"",{"$error":"#N/A"},{"$error":"#N/A"},{"$f":"Results!$B$6","v":0},null,{"$f":"CONCATENATE(Results!$C$4,\" - \",Results!$B$4)","v":"0 - 0"},{"$f":"CONCATENATE(Results!$C$5,\" - \",Results!$B$5)","v":"0 - 0"},{"$f":"Results!G26","v":false},"Purchasing",{"$f":"Results!C26","v":"Q4.3"},{"$f":"Results!D26","v":"Dans quelle mesure les méthodes de paiement des prestataires et les achats en général favorisent-ils la qualité des soins et la coordination des soins entre les spécialités et les différents niveaux de soins ?"},{"$f":"Results!F26","v":""},{"$f":"Q4.3","v":0}]
[{"$f":"Results!$B$2","v":0},"",{"$error":"#N/A"},{"$error":"#N/A"},{"$f":"Results!$B$6","v":0},null,{"$f":"CONCATENATE(Results!$C$4,\" - \",Results!$B$4)","v":"0 - 0"},{"$f":"CONCATENATE(Results!$C$5,\" - \",Results!$B$5)","v":"0 - 0"},{"$f":"Results!G27","v":false},"Purchasing",{"$f":"Results!C27","v":"Q4.4"},{"$f":"Results!D27","v":"Dans quelle mesure les contrats d’achat précisent-ils des exigences en matière de qualité des soins, y compris la disponibilité et la pertinence des soins, puis vérifient-ils de façon régulière qu’elles sont bien respectées ?"},{"$f":"Results!F27","v":""},{"$f":"Q4.4","v":0}]
[{"$f":"Results!$B$2","v":0},"",{"$error":"#N/A"},{"$error":"#N/A"},{"$f":"Results!$B$6","v":0},null,{"$f":"CONCATENATE(Results!$C$4,\" - \",Results!$B$4)","v":"0 - 0"},{"$f":"CONCATENATE(Results!$C$5,\" - \",Results!$B$5)","v":"0 - 0"},{"$f":"Results!G28","v":false},"Purchasing",{"$f":"Results!C28","v":"Q4.5"},{"$f":"Results!D28","v":"Dans quelle mesure les méthodes de paiement des prestataires favorisent-elles l’efficacité de l’allocation des ressources, par exemple en réduisant la prestation excessive ou en augmentant celle insuffisante des services, et gèrent-elles la croissance des dépenses ?"},{"$f":"Results!F28","v":""},{"$f":"Q4.5","v":0}]
[{"$f":"Results!$B$2","v":0},"",{"$error":"#N/A"},{"$error":"#N/A"},{"$f":"Results!$B$6","v":0},null,{"$f":"CONCATENATE(Results!$C$4,\" - \",Results!$B$4)","v":"0 - 0"},{"$f":"CONCATENATE(Results!$C$5,\" - \",Results!$B$5)","v":"0 - 0"},{"$f":"Results!G29","v":false},"Purchasing",{"$f":"Results!C29","v":"Q4.6"},{"$f":"Results!D29","v":"Dans quelle mesure les formulaires de consultation des patients sont-ils normalisés dans l'ensemble du système de santé et utilisés pour analyser et évaluer l'activité de l’ensemble des prestataires et de la population "},{"$f":"Results!F29","v":""},{"$f":"Q4.6","v":0}]
[{"$f":"Results!$B$2","v":0},"",{"$error":"#N/A"},{"$error":"#N/A"},{"$f":"Results!$B$6","v":0},null,{"$f":"CONCATENATE(Results!$C$4,\" - \",Results!$B$4)","v":"0 - 0"},{"$f":"CONCATENATE(Results!$C$5,\" - \",Results!$B$5)","v":"0 - 0"},{"$f":"Results!G30","v":false},"Purchasing",{"$f":"Results!C30","v":"Q4.7"},{"$f":"Results!D30","v":"Dans quelle mesure les paiements des prestataires  couvrent  uniquement une partie ou l’ensemble des coûts totaux (y compris les salaires, les dépenses récurrentes, etc.) ?"},{"$f":"Results!F30","v":""},{"$f":"Q4.7","v":0}]
[{"$f":"Results!$B$2","v":0},"",{"$error":"#N/A"},{"$error":"#N/A"},{"$f":"Results!$B$6","v":0},null,{"$f":"CONCATENATE(Results!$C$4,\" - \",Results!$B$4)","v":"0 - 0"},{"$f":"CONCATENATE(Results!$C$5,\" - \",Results!$B$5)","v":"0 - 0"},{"$f":"Results!G31","v":false},"Purchasing",{"$f":"Results!C31","v":"Q4.8"},{"$f":"Results!D31","v":"Dans quelle mesure les prestataires jouissent-ils d’une autonomie financière et sont-ils tenus responsables, dans une mesure réaliste et conforme à leurs capacités ?"},{"$f":"Results!F31","v":""},{"$f":"Q4.8","v":0}]
[{"$f":"Results!$B$2","v":0},"",{"$error":"#N/A"},{"$error":"#N/A"},{"$f":"Results!$B$6","v":0},null,{"$f":"CONCATENATE(Results!$C$4,\" - \",Results!$B$4)","v":"0 - 0"},{"$f":"CONCATENATE(Results!$C$5,\" - \",Results!$B$5)","v":"0 - 0"},{"$f":"Results!G32","v":false},"Purchasing",{"$f":"Results!C32","v":"Q4.9"},{"$f":"Results!D32","v":"Dans quelle mesure l’accréditation des prestataires ou les contrats sélectifs sont-ils établis, fonctionnels et utilisés pour les achats ?"},{"$f":"Results!F32","v":""},{"$f":"Q4.9","v":0}]
[{"$f":"Results!$B$2","v":0},"",{"$error":"#N/A"},{"$error":"#N/A"},{"$f":"Results!$B$6","v":0},null,{"$f":"CONCATENATE(Results!$C$4,\" - \",Results!$B$4)","v":"0 - 0"},{"$f":"CONCATENATE(Results!$C$5,\" - \",Results!$B$5)","v":"0 - 0"},{"$f":"Results!G33","v":false},"Purchasing",{"$f":"Results!C33","v":"Q4.10"},{"$f":"Results!D33","v":"Dans quelle mesure l’achat et le paiement des produits pharmaceutiques sont-ils mis en œuvre pour promouvoir l’utilisation efficace des médicaments (par exemple le recours aux génériques plutôt qu’aux princeps) et pour améliorer la protection financière des patients ?"},{"$f":"Results!F33","v":""},{"$f":"Q4.10","v":0}]
[{"$f":"Results!$B$2","v":0},"",{"$error":"#N/A"},{"$error":"#N/A"},{"$f":"Results!$B$6","v":0},null,{"$f":"CONCATENATE(Results!$C$4,\" - \",Results!$B$4)","v":"0 - 0"},{"$f":"CONCATENATE(Results!$C$5,\" - \",Results!$B$5)","v":"0 - 0"},{"$f":"Results!G34","v":false},"other",{"$f":"Results!C34","v":"Q5.1"},{"$f":"Results!D34","v":"Cette question a été maintenant remplacé par l’étape 1 et le tableau de vue d’ensemble et ne constitue donc plus une question distincte. Merci de bien vous assurer que vous avez complété l’étape 1 car cela vous aidera à remplir les questions de cette section."},{"$f":"Results!F34","v":""},{"$f":"Q5.1","v":0}]
[{"$f":"Results!$B$2","v":0},"",{"$error":"#N/A"},{"$error":"#N/A"},{"$f":"Results!$B$6","v":0},null,{"$f":"CONCATENATE(Results!$C$4,\" - \",Results!$B$4)","v":"0 - 0"},{"$f":"CONCATENATE(Results!$C$5,\" - \",Results!$B$5)","v":"0 - 0"},{"$f":"Results!G35","v":false},"Benefits",{"$f":"Results!C35","v":"Q5.2"},{"$f":"Results!D35","v":"Dans quelle mesure les décisions et les révisions relatives aux prestations sont-elles prises de manière transparente, sur la base d’un processus clairement défini et de critères convenus, tels que le rapport coût-efficacité, la protection financière, l’impact budgétaire ?"},{"$f":"Results!F35","v":""},{"$f":"Q5.2","v":0}]
[{"$f":"Results!$B$2","v":0},"",{"$error":"#N/A"},{"$error":"#N/A"},{"$f":"Results!$B$6","v":0},null,{"$f":"CONCATENATE(Results!$C$4,\" - \",Results!$B$4)","v":"0 - 0"},{"$f":"CONCATENATE(Results!$C$5,\" - \",Results!$B$5)","v":"0 - 0"},{"$f":"Results!G36","v":false},"Benefits",{"$f":"Results!C36","v":"Q5.3"},{"$f":"Results!D36","v":"Dans quelle mesure les droits à prestation reflètent-ils explicitement les besoins de santé de la population ?"},{"$f":"Results!F36","v":""},{"$f":"Q5.3","v":0}]
[{"$f":"Results!$B$2","v":0},"",{"$error":"#N/A"},{"$error":"#N/A"},{"$f":"Results!$B$6","v":0},null,{"$f":"CONCATENATE(Results!$C$4,\" - \",Results!$B$4)","v":"0 - 0"},{"$f":"CONCATENATE(Results!$C$5,\" - \",Results!$B$5)","v":"0 - 0"},{"$f":"Results!G37","v":false},"Benefits",{"$f":"Results!C37","v":"Q5.4"},{"$f":"Results!D37","v":"Dans quelle mesure les prestations accordent-elles la priorité aux catégories de population prioritaires, par exemple pour une meilleure utilisation des services hautement prioritaires et pour la protection financière ?"},{"$f":"Results!F37","v":""},{"$f":"Q5.4","v":0}]
[{"$f":"Results!$B$2","v":0},"",{"$error":"#N/A"},{"$error":"#N/A"},{"$f":"Results!$B$6","v":0},null,{"$f":"CONCATENATE(Results!$C$4,\" - \",Results!$B$4)","v":"0 - 0"},{"$f":"CONCATENATE(Results!$C$5,\" - \",Results!$B$5)","v":"0 - 0"},{"$f":"Results!G38","v":false},"Benefits",{"$f":"Results!C38","v":"Q5.5"},{"$f":"Results!D38","v":"Dans quelle mesure les droits et obligations de la population sont-ils explicitement définis et compris par les intéressés ?"},{"$f":"Results!F38","v":""},{"$f":"Q5.5","v":0}]
[{"$f":"Results!$B$2","v":0},"",{"$error":"#N/A"},{"$error":"#N/A"},{"$f":"Results!$B$6","v":0},null,{"$f":"CONCATENATE(Results!$C$4,\" - \",Results!$B$4)","v":"0 - 0"},{"$f":"CONCATENATE(Results!$C$5,\" - \",Results!$B$5)","v":"0 - 0"},{"$f":"Results!G39","v":false},"Benefits",{"$f":"Results!C39","v":"Q5.6"},{"$f":"Results!D39","v":"Dans quelle mesure les prestations sont-elles alignées sur le paiement des prestataires, afin de s’assurer qu’elles sont fournies et que les patients bénéficient d’une protection financière ?"},{"$f":"Results!F39","v":""},{"$f":"Q5.6","v":0}]
[{"$f":"Results!$B$2","v":0},{"$f":"code","v":""},{"$error":"#N/A"},{"$error":"#N/A"},{"$f":"Results!$B$6","v":0},null,{"$f":"CONCATENATE(Results!$C$4,\" - \",Results!$B$4)","v":"0 - 0"},{"$f":"CONCATENATE(Results!$C$5,\" - \",Results!$B$5)","v":"0 - 0"},{"$f":"Results!G40","v":false},"Benefits",{"$f":"Results!C40","v":"Q5.7"},{"$f":"Results!D40","v":"Dans quelle mesure les prestations, y compris le partage des coûts pour les patients, sont-elles alignées sur les recettes, afin d’assurer un financement adéquat des droits à prestations approuvés ?"},{"$f":"Results!F40","v":""},{"$f":"Q5.7","v":0}]
[{"$f":"Results!$B$2","v":0},"",{"$error":"#N/A"},{"$error":"#N/A"},{"$f":"Results!$B$6","v":0},null,{"$f":"CONCATENATE(Results!$C$4,\" - \",Results!$B$4)","v":"0 - 0"},{"$f":"CONCATENATE(Results!$C$5,\" - \",Results!$B$5)","v":"0 - 0"},{"$f":"Results!G41","v":false},"PFM",{"$f":"Results!C41","v":"Q6.1"},{"$f":"Results!D41","v":"Est-ce qu’un diagnostic/une évaluation approfondi(e) des goulets d’étranglement de la GFP dans le secteur de la santé a été effectué(e) récemment, par exemple au cours des trois dernières années ?"},{"$f":"Results!F41","v":""},{"$f":"Q6.1","v":0}]
[{"$f":"Results!$B$2","v":0},"",{"$error":"#N/A"},{"$error":"#N/A"},{"$f":"Results!$B$6","v":0},null,{"$f":"CONCATENATE(Results!$C$4,\" - \",Results!$B$4)","v":"0 - 0"},{"$f":"CONCATENATE(Results!$C$5,\" - \",Results!$B$5)","v":"0 - 0"},{"$f":"Results!G42","v":false},"PFM",{"$f":"Results!C42","v":"Q6.2"},{"$f":"Results!D42","v":"Le personnel du Ministère de la santé dispose-t-il de capacités à comprendre les (nouvelles) règles de GFP et à les appliquer au processus budgétaire du secteur de la santé ?"},{"$f":"Results!F42","v":""},{"$f":"Q6.2","v":0}]
[{"$f":"Results!$B$2","v":0},"",{"$error":"#N/A"},{"$error":"#N/A"},{"$f":"Results!$B$6","v":0},null,{"$f":"CONCATENATE(Results!$C$4,\" - \",Results!$B$4)","v":"0 - 0"},{"$f":"CONCATENATE(Results!$C$5,\" - \",Results!$B$5)","v":"0 - 0"},{"$f":"Results!G43","v":false},"PFM",{"$f":"Results!C43","v":"Q6.3"},{"$f":"Results!D43","v":"Existe-il un processus budgétaire pluriannuel mis en œuvre efficacement ?"},{"$f":"Results!F43","v":""},{"$f":"Q6.3","v":0}]
[{"$f":"Results!$B$2","v":0},"",{"$error":"#N/A"},{"$error":"#N/A"},{"$f":"Results!$B$6","v":0},null,{"$f":"CONCATENATE(Results!$C$4,\" - \",Results!$B$4)","v":"0 - 0"},{"$f":"CONCATENATE(Results!$C$5,\" - \",Results!$B$5)","v":"0 - 0"},{"$f":"Results!G44","v":false},"PFM",{"$f":"Results!C44","v":"Q6.4"},{"$f":"Results!D44","v":"Dans quelle mesure les allocations budgétaires annuelles en matière de santé sont alignées sur les priorités du secteur de la santé (niveau, structure, nature/objectif) ?"},{"$f":"Results!F44","v":""},{"$f":"Q6.4","v":0}]
[{"$f":"Results!$B$2","v":0},"",{"$error":"#N/A"},{"$error":"#N/A"},{"$f":"Results!$B$6","v":0},null,{"$f":"CONCATENATE(Results!$C$4,\" - \",Results!$B$4)","v":"0 - 0"},{"$f":"CONCATENATE(Results!$C$5,\" - \",Results!$B$5)","v":"0 - 0"},{"$f":"Results!G45","v":false},"PFM",{"$f":"Results!C45","v":"Q6.5"},{"$f":"Results!D45","v":"Dans quelle mesure le processus budgétaire est consultatif, transparent et un processus d’examen et d’ajustement budgétaire à mi-parcours est établi ?"},{"$f":"Results!F45","v":""},{"$f":"Q6.5","v":0}]
[{"$f":"Results!$B$2","v":0},"",{"$error":"#N/A"},{"$error":"#N/A"},{"$f":"Results!$B$6","v":0},null,{"$f":"CONCATENATE(Results!$C$4,\" - \",Results!$B$4)","v":"0 - 0"},{"$f":"CONCATENATE(Results!$C$5,\" - \",Results!$B$5)","v":"0 - 0"},{"$f":"Results!G46","v":false},"PFM",{"$f":"Results!C46","v":"Q6.6"},{"$f":"Results!D46","v":"Dans quelle mesure les transferts fiscaux sont conçus et mis en œuvre de sorte à améliorer l’équité de la distribution des ressources dans le secteur de la santé?"},{"$f":"Results!F46","v":""},{"$f":"Q6.6","v":0}]
[{"$f":"Results!$B$2","v":0},"",{"$error":"#N/A"},{"$error":"#N/A"},{"$f":"Results!$B$6","v":0},null,{"$f":"CONCATENATE(Results!$C$4,\" - \",Results!$B$4)","v":"0 - 0"},{"$f":"CONCATENATE(Results!$C$5,\" - \",Results!$B$5)","v":"0 - 0"},{"$f":"Results!G47","v":false},"PFM",{"$f":"Results!C47","v":"Q6.7"},{"$f":"Results!D47","v":"Dans quelle mesure les règles du budget de la santé permettent-elles une certaine souplesse des dépenses? "},{"$f":"Results!F47","v":""},{"$f":"Q6.7","v":0}]
[{"$f":"Results!$B$2","v":0},"",{"$error":"#N/A"},{"$error":"#N/A"},{"$f":"Results!$B$6","v":0},null,{"$f":"CONCATENATE(Results!$C$4,\" - \",Results!$B$4)","v":"0 - 0"},{"$f":"CONCATENATE(Results!$C$5,\" - \",Results!$B$5)","v":"0 - 0"},{"$f":"Results!G48","v":false},"PFM",{"$f":"Results!C48","v":"Q6.8"},{"$f":"Results!D48","v":"La flexibilité dans l’utilisation des ressources est-elle assurée ou déléguée au bon niveau?"},{"$f":"Results!F48","v":""},{"$f":"Q6.8","v":0}]
[{"$f":"Results!$B$2","v":0},"",{"$error":"#N/A"},{"$error":"#N/A"},{"$f":"Results!$B$6","v":0},null,{"$f":"CONCATENATE(Results!$C$4,\" - \",Results!$B$4)","v":"0 - 0"},{"$f":"CONCATENATE(Results!$C$5,\" - \",Results!$B$5)","v":"0 - 0"},{"$f":"Results!G49","v":false},"PFM",{"$f":"Results!C49","v":"Q6.9"},{"$f":"Results!D49","v":"Dans quelle mesure des politiques de discipline budgétaire visant à contrôler les dépenses sont en vigueur (par exemple, gestion de la trésorerie, respect des règles d’approvisionnement) et mises en œuvre efficacement?"},{"$f":"Results!F49","v":""},{"$f":"Q6.9","v":0}]
[{"$f":"Results!$B$2","v":0},"",{"$error":"#N/A"},{"$error":"#N/A"},{"$f":"Results!$B$6","v":0},null,{"$f":"CONCATENATE(Results!$C$4,\" - \",Results!$B$4)","v":"0 - 0"},{"$f":"CONCATENATE(Results!$C$5,\" - \",Results!$B$5)","v":"0 - 0"},{"$f":"Results!G50","v":false},"PFM",{"$f":"Results!C50","v":"Q6.10"},{"$f":"Results!D50","v":"Dans quelle mesure des systèmes d’information sont en place pour répondre aux besoins en matière de responsabilité financière et pour assurer le suivi des performances du secteur de la santé?"},{"$f":"Results!F50","v":""},{"$f":"Q6.10","v":0}]
[{"$f":"Results!$B$2","v":0},"",{"$error":"#N/A"},{"$error":"#N/A"},{"$f":"Results!$B$6","v":0},null,{"$f":"CONCATENATE(Results!$C$4,\" - \",Results!$B$4)","v":"0 - 0"},{"$f":"CONCATENATE(Results!$C$5,\" - \",Results!$B$5)","v":"0 - 0"},{"$f":"Results!G51","v":false},"PFM",{"$f":"Results!C51","v":"Q6.11"},{"$f":"Results!D51","v":"Dans quelle mesure les flux financiers multiples, la structure budgétaire et les règles de GFP sont alignés sur les politiques d’achats stratégiques?"},{"$f":"Results!F51","v":""},{"$f":"Q6.11","v":0}]
[{"$f":"Results!$B$2","v":0},"",{"$error":"#N/A"},{"$error":"#N/A"},{"$f":"Results!$B$6","v":0},null,{"$f":"CONCATENATE(Results!$C$4,\" - \",Results!$B$4)","v":"0 - 0"},{"$f":"CONCATENATE(Results!$C$5,\" - \",Results!$B$5)","v":"0 - 0"},{"$f":"Results!G52","v":false},"Governance",{"$f":"Results!C52","v":"Q7.1"},{"$f":"Results!D52","v":"Dans quelle mesure les rôles et les responsabilités (liés aux objectifs de financement de la santé et au rendement en matière de collecte de recettes, de mise en commun, d’achats, de prestations, etc.) sont clairement définis et répartis entre les institutions responsables du financement de la santé ?"},{"$f":"Results!F52","v":""},{"$f":"Q7.1","v":0}]
[{"$f":"Results!$B$2","v":0},"",{"$error":"#N/A"},{"$error":"#N/A"},{"$f":"Results!$B$6","v":0},null,{"$f":"CONCATENATE(Results!$C$4,\" - \",Results!$B$4)","v":"0 - 0"},{"$f":"CONCATENATE(Results!$C$5,\" - \",Results!$B$5)","v":"0 - 0"},{"$f":"Results!G53","v":false},"Governance",{"$f":"Results!C53","v":"Q7.2"},{"$f":"Results!D53","v":"Dans quelle mesure les institutions responsables du financement de la santé disposent-elles de capacités adéquates, notamment en matière de ressources humaines (capacités techniques et managériales) et de TIC ?"},{"$f":"Results!F53","v":""},{"$f":"Q7.2","v":0}]
[{"$f":"Results!$B$2","v":0},"",{"$error":"#N/A"},{"$error":"#N/A"},{"$f":"Results!$B$6","v":0},null,{"$f":"CONCATENATE(Results!$C$4,\" - \",Results!$B$4)","v":"0 - 0"},{"$f":"CONCATENATE(Results!$C$5,\" - \",Results!$B$5)","v":"0 - 0"},{"$f":"Results!G54","v":false},"Governance",{"$f":"Results!C54","v":"Q7.3"},{"$f":"Results!D54","v":"Dans quelle mesure les mécanismes de responsabilisation des organismes d’achat/de financement (y compris l’autonomie et le conseil d’administration de l’agence d’assurance-maladie, les mécanismes de récompense/sanction, etc.) sont-ils en place pour s’assurer que la politique de financement de la santé appuie les progrès vers les objectifs du secteur et que les fonds sont utilisés efficacement pour les populations, programmes et services prioritaires ?"},{"$f":"Results!F54","v":""},{"$f":"Q7.3","v":0}]
[{"$f":"Results!$B$2","v":0},"",{"$error":"#N/A"},{"$error":"#N/A"},{"$f":"Results!$B$6","v":0},null,{"$f":"CONCATENATE(Results!$C$4,\" - \",Results!$B$4)","v":"0 - 0"},{"$f":"CONCATENATE(Results!$C$5,\" - \",Results!$B$5)","v":"0 - 0"},{"$f":"Results!G55","v":false},"Governance",{"$f":"Results!C55","v":"Q7.4"},{"$f":"Results!D55","v":"L’utilisation des fonds ou les performances des institutions achetant des services auprès des prestataires de services de santé ou le budget de la santé ont-ils été communiqués au public (par exemple sous forme de rapport annuel) ?"},{"$f":"Results!F55","v":""},{"$f":"Q7.4","v":0}]
[{"$f":"Results!$B$2","v":0},"",{"$error":"#N/A"},{"$error":"#N/A"},{"$f":"Results!$B$6","v":0},null,{"$f":"CONCATENATE(Results!$C$4,\" - \",Results!$B$4)","v":"0 - 0"},{"$f":"CONCATENATE(Results!$C$5,\" - \",Results!$B$5)","v":"0 - 0"},{"$f":"Results!G56","v":false},"Governance",{"$f":"Results!C56","v":"Q7.5"},{"$f":"Results!D56","v":"Dans quelle mesure le Ministère des finances, le Ministère de la santé et l’organisme national d’assurance-maladie participent au processus d’élaboration des politiques de financement de la santé et en sont informés ?"},{"$f":"Results!F56","v":""},{"$f":"Q7.5","v":0}]
[{"$f":"Results!$B$2","v":0},"",{"$error":"#N/A"},{"$error":"#N/A"},{"$f":"Results!$B$6","v":0},null,{"$f":"CONCATENATE(Results!$C$4,\" - \",Results!$B$4)","v":"0 - 0"},{"$f":"CONCATENATE(Results!$C$5,\" - \",Results!$B$5)","v":"0 - 0"},{"$f":"Results!G57","v":false},"Governance",{"$f":"Results!C57","v":"Q7.6"},{"$f":"Results!D57","v":"Dans quelle mesure le processus d’élaboration des politiques de financement de la santé est transparent et participatif?"},{"$f":"Results!F57","v":""},{"$f":"Q7.6","v":0}]
[{"$f":"Results!$B$2","v":0},"",{"$error":"#N/A"},{"$error":"#N/A"},{"$f":"Results!$B$6","v":0},null,{"$f":"CONCATENATE(Results!$C$4,\" - \",Results!$B$4)","v":"0 - 0"},{"$f":"CONCATENATE(Results!$C$5,\" - \",Results!$B$5)","v":"0 - 0"},false,"Stage1",{"$f":"Results!$B$63","v":"HEALTH INSURANCE SCHEME\n(add specific name in your country)"},{"$f":"Results!A64","v":"POPULATION CIBLE\nTous les citoyens sont-ils couverts ou un sous-groupe spécifique, par exemple moins de 5 ans, salariés?\n"},{"$f":"QA.1.1","v":0},0]
[{"$f":"Results!$B$2","v":0},"",{"$error":"#N/A"},{"$error":"#N/A"},{"$f":"Results!$B$6","v":0},null,{"$f":"CONCATENATE(Results!$C$4,\" - \",Results!$B$4)","v":"0 - 0"},{"$f":"CONCATENATE(Results!$C$5,\" - \",Results!$B$5)","v":"0 - 0"},false,"Stage1",{"$f":"Results!$B$63","v":"HEALTH INSURANCE SCHEME\n(add specific name in your country)"},{"$f":"Results!A65","v":"POPULATION COUVERTE / souscrite\nNombre réel relatif à la pop cible.\n"},{"$f":"QA.1.2","v":0},0]
[{"$f":"Results!$B$2","v":0},"",{"$error":"#N/A"},{"$error":"#N/A"},{"$f":"Results!$B$6","v":0},null,{"$f":"CONCATENATE(Results!$C$4,\" - \",Results!$B$4)","v":"0 - 0"},{"$f":"CONCATENATE(Results!$C$5,\" - \",Results!$B$5)","v":"0 - 0"},false,"Stage1",{"$f":"Results!$B$63","v":"HEALTH INSURANCE SCHEME\n(add specific name in your country)"},{"$f":"Results!A66","v":"BASE DE COUVERTURE / SOUSCRIPTION\nPar exemple. obligatoire, automatique, volontaire\n"},{"$f":"QA.1.3","v":0},0]
[{"$f":"Results!$B$2","v":0},"",{"$error":"#N/A"},{"$error":"#N/A"},{"$f":"Results!$B$6","v":0},null,{"$f":"CONCATENATE(Results!$C$4,\" - \",Results!$B$4)","v":"0 - 0"},{"$f":"CONCATENATE(Results!$C$5,\" - \",Results!$B$5)","v":"0 - 0"},false,"Stage1",{"$f":"Results!$B$63","v":"HEALTH INSURANCE SCHEME\n(add specific name in your country)"},{"$f":"Results!A67","v":"AVANTAGES / DROITS\nUne liste de services ou niveau de soins est-elle définie? Est-ce que les utilisateurs doivent faire des co-paiements?\n"},{"$f":"QA.1.4","v":0},0]
[{"$f":"Results!$B$2","v":0},"",{"$error":"#N/A"},{"$error":"#N/A"},{"$f":"Results!$B$6","v":0},null,{"$f":"CONCATENATE(Results!$C$4,\" - \",Results!$B$4)","v":"0 - 0"},{"$f":"CONCATENATE(Results!$C$5,\" - \",Results!$B$5)","v":"0 - 0"},false,"Stage1",{"$f":"Results!$B$63","v":"HEALTH INSURANCE SCHEME\n(add specific name in your country)"},{"$f":"Results!A68","v":"SOURCES DE REVENUS\nD'où vient l'argent? Allocations / transferts budgétaires; contributions prépayées.\n"},{"$f":"QA.1.5","v":0},0]
[{"$f":"Results!$B$2","v":0},"",{"$error":"#N/A"},{"$error":"#N/A"},{"$f":"Results!$B$6","v":0},null,{"$f":"CONCATENATE(Results!$C$4,\" - \",Results!$B$4)","v":"0 - 0"},{"$f":"CONCATENATE(Results!$C$5,\" - \",Results!$B$5)","v":"0 - 0"},false,"Stage1",{"$f":"Results!$B$63","v":"HEALTH INSURANCE SCHEME\n(add specific name in your country)"},{"$f":"Results!A69","v":"ACCORDS DE MISE EN COMMUN\nLe budget de la santé est-il alloué aux autorités régionales, existe-t-il un ou plusieurs fonds d '«assurance»?\n"},{"$f":"QA.1.6","v":0},0]
[{"$f":"Results!$B$2","v":0},"",{"$error":"#N/A"},{"$error":"#N/A"},{"$f":"Results!$B$6","v":0},null,{"$f":"CONCATENATE(Results!$C$4,\" - \",Results!$B$4)","v":"0 - 0"},{"$f":"CONCATENATE(Results!$C$5,\" - \",Results!$B$5)","v":"0 - 0"},false,"Stage1",{"$f":"Results!$B$63","v":"HEALTH INSURANCE SCHEME\n(add specific name in your country)"},{"$f":"Results!A70","v":"MODALITES D'ACHAT\nDécrivez les arrangements de gestion et de gouvernance?\n"},{"$f":"QA.1.7","v":0},0]
[{"$f":"Results!$B$2","v":0},"",{"$error":"#N/A"},{"$error":"#N/A"},{"$f":"Results!$B$6","v":0},null,{"$f":"CONCATENATE(Results!$C$4,\" - \",Results!$B$4)","v":"0 - 0"},{"$f":"CONCATENATE(Results!$C$5,\" - \",Results!$B$5)","v":"0 - 0"},false,"Stage1",{"$f":"Results!$B$63","v":"HEALTH INSURANCE SCHEME\n(add specific name in your country)"},{"$f":"Results!A71","v":"PAIEMENT DU FOURNISSEUR\nPar exemple. les entrées par ligne ou poste budgétaire; Ticket de soins/Service, paiement au cas par cas, capitation, basé sur performances?\n"},{"$f":"QA.1.8","v":0},0]
[{"$f":"Results!$B$2","v":0},"",{"$error":"#N/A"},{"$error":"#N/A"},{"$f":"Results!$B$6","v":0},null,{"$f":"CONCATENATE(Results!$C$4,\" - \",Results!$B$4)","v":"0 - 0"},{"$f":"CONCATENATE(Results!$C$5,\" - \",Results!$B$5)","v":"0 - 0"},false,"Stage1",{"$f":"Results!$B$63","v":"HEALTH INSURANCE SCHEME\n(add specific name in your country)"},{"$f":"Results!A72","v":"PRESTATION DE SERVICES & CONTRACTUALISATION\nDe quels fournisseurs les services sont-ils achetés? Public-privé? Des contrats / accords de services sont-ils utilisés?\n"},{"$f":"QA.1.9","v":0},0]
[{"$f":"Results!$B$2","v":0},"",{"$error":"#N/A"},{"$error":"#N/A"},{"$f":"Results!$B$6","v":0},null,{"$f":"CONCATENATE(Results!$C$4,\" - \",Results!$B$4)","v":"0 - 0"},{"$f":"CONCATENATE(Results!$C$5,\" - \",Results!$B$5)","v":"0 - 0"},false,"Stage1",{"$f":"Results!$C$63","v":"OTHER COVERAGE SCHEME \n(add specific name in your country)"},{"$f":"L52","v":"POPULATION CIBLE\nTous les citoyens sont-ils couverts ou un sous-groupe spécifique, par exemple moins de 5 ans, salariés?\n"},{"$f":"QA.2.1","v":0},0]
[{"$f":"Results!$B$2","v":0},"",{"$error":"#N/A"},{"$error":"#N/A"},{"$f":"Results!$B$6","v":0},null,{"$f":"CONCATENATE(Results!$C$4,\" - \",Results!$B$4)","v":"0 - 0"},{"$f":"CONCATENATE(Results!$C$5,\" - \",Results!$B$5)","v":"0 - 0"},false,"Stage1",{"$f":"K61","v":"OTHER COVERAGE SCHEME \n(add specific name in your country)"},{"$f":"L53","v":"POPULATION COUVERTE / souscrite\nNombre réel relatif à la pop cible.\n"},{"$f":"QA.2.2","v":0},0]
[{"$f":"Results!$B$2","v":0},"",{"$error":"#N/A"},{"$error":"#N/A"},{"$f":"Results!$B$6","v":0},null,{"$f":"CONCATENATE(Results!$C$4,\" - \",Results!$B$4)","v":"0 - 0"},{"$f":"CONCATENATE(Results!$C$5,\" - \",Results!$B$5)","v":"0 - 0"},false,"Stage1",{"$f":"K62","v":"OTHER COVERAGE SCHEME \n(add specific name in your country)"},"BASE DE COUVERTURE / SOUSCRIPTION\nPar exemple. obligatoire, automatique, volontaire\n",{"$f":"QA.2.3","v":0},0]
[{"$f":"Results!$B$2","v":0},"",{"$error":"#N/A"},{"$error":"#N/A"},{"$f":"Results!$B$6","v":0},null,{"$f":"CONCATENATE(Results!$C$4,\" - \",Results!$B$4)","v":"0 - 0"},{"$f":"CONCATENATE(Results!$C$5,\" - \",Results!$B$5)","v":"0 - 0"},false,"Stage1","OTHER COVERAGE SCHEME \n(add specific name in your country)","AVANTAGES / DROITS\nUne liste de services ou niveau de soins est-elle définie? Est-ce que les utilisateurs doivent faire des co-paiements?\n",{"$f":"QA.2.4","v":0},0]
[{"$f":"Results!$B$2","v":0},"",{"$error":"#N/A"},{"$error":"#N/A"},{"$f":"Results!$B$6","v":0},null,{"$f":"CONCATENATE(Results!$C$4,\" - \",Results!$B$4)","v":"0 - 0"},{"$f":"CONCATENATE(Results!$C$5,\" - \",Results!$B$5)","v":"0 - 0"},false,"Stage1","OTHER COVERAGE SCHEME \n(add specific name in your country)","SOURCES DE REVENUS\nD'où vient l'argent? Allocations / transferts budgétaires; contributions prépayées.\n",{"$f":"QA.2.5","v":0},0]
[{"$f":"Results!$B$2","v":0},"",{"$error":"#N/A"},{"$error":"#N/A"},{"$f":"Results!$B$6","v":0},null,{"$f":"CONCATENATE(Results!$C$4,\" - \",Results!$B$4)","v":"0 - 0"},{"$f":"CONCATENATE(Results!$C$5,\" - \",Results!$B$5)","v":"0 - 0"},false,"Stage1","OTHER COVERAGE SCHEME \n(add specific name in your country)","ACCORDS DE MISE EN COMMUN\nLe budget de la santé est-il alloué aux autorités régionales, existe-t-il un ou plusieurs fonds d '«assurance»?\n",{"$f":"QA.2.6","v":0},0]
[{"$f":"Results!$B$2","v":0},"",{"$error":"#N/A"},{"$error":"#N/A"},{"$f":"Results!$B$6","v":0},null,{"$f":"CONCATENATE(Results!$C$4,\" - \",Results!$B$4)","v":"0 - 0"},{"$f":"CONCATENATE(Results!$C$5,\" - \",Results!$B$5)","v":"0 - 0"},false,"Stage1","OTHER COVERAGE SCHEME \n(add specific name in your country)","MODALITES D'ACHAT\nDécrivez les arrangements de gestion et de gouvernance?\n",{"$f":"QA.2.7","v":0},0]
[{"$f":"Results!$B$2","v":0},"",{"$f":"C67","v":{"$error":"#N/A"}},{"$f":"D67","v":{"$error":"#N/A"}},{"$f":"Results!$B$6","v":0},null,{"$f":"CONCATENATE(Results!$C$4,\" - \",Results!$B$4)","v":"0 - 0"},{"$f":"CONCATENATE(Results!$C$5,\" - \",Results!$B$5)","v":"0 - 0"},false,"Stage1","OTHER COVERAGE SCHEME \n(add specific name in your country)","PAIEMENT DU FOURNISSEUR\nPar exemple. les entrées par ligne ou poste budgétaire; Ticket de soins/Service, paiement au cas par cas, capitation, basé sur performances?\n",{"$f":"QA.2.8","v":0},0]
[{"$f":"Results!$B$2","v":0},"",{"$error":"#N/A"},{"$error":"#N/A"},{"$f":"Results!$B$6","v":0},null,{"$f":"CONCATENATE(Results!$C$4,\" - \",Results!$B$4)","v":"0 - 0"},{"$f":"CONCATENATE(Results!$C$5,\" - \",Results!$B$5)","v":"0 - 0"},false,"Stage1","OTHER COVERAGE SCHEME \n(add specific name in your country)","PRESTATION DE SERVICES & CONTRACTUALISATION\nDe quels fournisseurs les services sont-ils achetés? Public-privé? Des contrats / accords de services sont-ils utilisés?\n",{"$f":"QA.2.9","v":0},0]
[{"$f":"Results!$B$2","v":0},"",{"$error":"#N/A"},{"$error":"#N/A"},{"$f":"Results!$B$6","v":0},null,{"$f":"CONCATENATE(Results!$C$4,\" - \",Results!$B$4)","v":"0 - 0"},{"$f":"CONCATENATE(Results!$C$5,\" - \",Results!$B$5)","v":"0 - 0"},false,"Stage1",{"$f":"Results!$D$63","v":"OTHER COVERAGE SCHEME\n(add specific name in your country)"},{"$f":"L61","v":"POPULATION CIBLE\nTous les citoyens sont-ils couverts ou un sous-groupe spécifique, par exemple moins de 5 ans, salariés?\n"},{"$f":"QA.3.1","v":0},0]
[{"$f":"Results!$B$2","v":0},"",{"$error":"#N/A"},{"$error":"#N/A"},{"$f":"Results!$B$6","v":0},null,{"$f":"CONCATENATE(Results!$C$4,\" - \",Results!$B$4)","v":"0 - 0"},{"$f":"CONCATENATE(Results!$C$5,\" - \",Results!$B$5)","v":"0 - 0"},false,"Stage1",{"$f":"K70","v":"OTHER COVERAGE SCHEME\n(add specific name in your country)"},"POPULATION COUVERTE / souscrite\nNombre réel relatif à la pop cible.\n",{"$f":"QA.3.2","v":0},0]
[{"$f":"Results!$B$2","v":0},"",{"$error":"#N/A"},{"$error":"#N/A"},{"$f":"Results!$B$6","v":0},null,{"$f":"CONCATENATE(Results!$C$4,\" - \",Results!$B$4)","v":"0 - 0"},{"$f":"CONCATENATE(Results!$C$5,\" - \",Results!$B$5)","v":"0 - 0"},false,"Stage1",{"$f":"K71","v":"OTHER COVERAGE SCHEME\n(add specific name in your country)"},"BASE DE COUVERTURE / SOUSCRIPTION\nPar exemple. obligatoire, automatique, volontaire\n",{"$f":"QA.3.3","v":0},0]
[{"$f":"Results!$B$2","v":0},"",{"$error":"#N/A"},{"$error":"#N/A"},{"$f":"Results!$B$6","v":0},null,{"$f":"CONCATENATE(Results!$C$4,\" - \",Results!$B$4)","v":"0 - 0"},{"$f":"CONCATENATE(Results!$C$5,\" - \",Results!$B$5)","v":"0 - 0"},false,"Stage1","OTHER COVERAGE SCHEME\n(add specific name in your country)","AVANTAGES / DROITS\nUne liste de services ou niveau de soins est-elle définie? Est-ce que les utilisateurs doivent faire des co-paiements?\n",{"$f":"QA.3.4","v":0},0]
[{"$f":"Results!$B$2","v":0},"",{"$error":"#N/A"},{"$error":"#N/A"},{"$f":"Results!$B$6","v":0},null,{"$f":"CONCATENATE(Results!$C$4,\" - \",Results!$B$4)","v":"0 - 0"},{"$f":"CONCATENATE(Results!$C$5,\" - \",Results!$B$5)","v":"0 - 0"},false,"Stage1","OTHER COVERAGE SCHEME\n(add specific name in your country)","SOURCES DE REVENUS\nD'où vient l'argent? Allocations / transferts budgétaires; contributions prépayées.\n",{"$f":"QA.3.5","v":0},0]
[{"$f":"Results!$B$2","v":0},"",{"$error":"#N/A"},{"$error":"#N/A"},{"$f":"Results!$B$6","v":0},null,{"$f":"CONCATENATE(Results!$C$4,\" - \",Results!$B$4)","v":"0 - 0"},{"$f":"CONCATENATE(Results!$C$5,\" - \",Results!$B$5)","v":"0 - 0"},false,"Stage1","OTHER COVERAGE SCHEME\n(add specific name in your country)","ACCORDS DE MISE EN COMMUN\nLe budget de la santé est-il alloué aux autorités régionales, existe-t-il un ou plusieurs fonds d '«assurance»?\n",{"$f":"QA.3.6","v":0},0]
[{"$f":"Results!$B$2","v":0},"",{"$error":"#N/A"},{"$error":"#N/A"},{"$f":"Results!$B$6","v":0},null,{"$f":"CONCATENATE(Results!$C$4,\" - \",Results!$B$4)","v":"0 - 0"},{"$f":"CONCATENATE(Results!$C$5,\" - \",Results!$B$5)","v":"0 - 0"},false,"Stage1","OTHER COVERAGE SCHEME\n(add specific name in your country)","MODALITES D'ACHAT\nDécrivez les arrangements de gestion et de gouvernance?\n",{"$f":"QA.3.7","v":0},0]
[{"$f":"Results!$B$2","v":0},"",{"$error":"#N/A"},{"$error":"#N/A"},{"$f":"Results!$B$6","v":0},null,{"$f":"CONCATENATE(Results!$C$4,\" - \",Results!$B$4)","v":"0 - 0"},{"$f":"CONCATENATE(Results!$C$5,\" - \",Results!$B$5)","v":"0 - 0"},false,"Stage1","OTHER COVERAGE SCHEME\n(add specific name in your country)","PAIEMENT DU FOURNISSEUR\nPar exemple. les entrées par ligne ou poste budgétaire; Ticket de soins/Service, paiement au cas par cas, capitation, basé sur performances?\n",{"$f":"QA.3.8","v":0},0]
[{"$f":"Results!$B$2","v":0},"",{"$error":"#N/A"},{"$error":"#N/A"},{"$f":"Results!$B$6","v":0},null,{"$f":"CONCATENATE(Results!$C$4,\" - \",Results!$B$4)","v":"0 - 0"},{"$f":"CONCATENATE(Results!$C$5,\" - \",Results!$B$5)","v":"0 - 0"},false,"Stage1","OTHER COVERAGE SCHEME\n(add specific name in your country)","PRESTATION DE SERVICES & CONTRACTUALISATION\nDe quels fournisseurs les services sont-ils achetés? Public-privé? Des contrats / accords de services sont-ils utilisés?\n",{"$f":"QA.3.9","v":0},0]
[{"$f":"Results!$B$2","v":0},"",{"$error":"#N/A"},{"$error":"#N/A"},{"$f":"Results!$B$6","v":0},null,{"$f":"CONCATENATE(Results!$C$4,\" - \",Results!$B$4)","v":"0 - 0"},{"$f":"CONCATENATE(Results!$C$5,\" - \",Results!$B$5)","v":"0 - 0"},false,"Stage1",{"$f":"Results!$E$63","v":"OTHER COVERAGE SCHEME\n(add specific name in your country)"},{"$f":"L70","v":"POPULATION CIBLE\nTous les citoyens sont-ils couverts ou un sous-groupe spécifique, par exemple moins de 5 ans, salariés?\n"},{"$f":"QA.4.1","v":0},0]
[{"$f":"Results!$B$2","v":0},"",{"$error":"#N/A"},{"$error":"#N/A"},{"$f":"Results!$B$6","v":0},null,{"$f":"CONCATENATE(Results!$C$4,\" - \",Results!$B$4)","v":"0 - 0"},{"$f":"CONCATENATE(Results!$C$5,\" - \",Results!$B$5)","v":"0 - 0"},false,"Stage1",{"$f":"K79","v":"OTHER COVERAGE SCHEME\n(add specific name in your country)"},"POPULATION COUVERTE / souscrite\nNombre réel relatif à la pop cible.\n",{"$f":"QA.4.2","v":0},0]
[{"$f":"Results!$B$2","v":0},"",{"$error":"#N/A"},{"$error":"#N/A"},{"$f":"Results!$B$6","v":0},null,{"$f":"CONCATENATE(Results!$C$4,\" - \",Results!$B$4)","v":"0 - 0"},{"$f":"CONCATENATE(Results!$C$5,\" - \",Results!$B$5)","v":"0 - 0"},false,"Stage1",{"$f":"K80","v":"OTHER COVERAGE SCHEME\n(add specific name in your country)"},"BASE DE COUVERTURE / SOUSCRIPTION\nPar exemple. obligatoire, automatique, volontaire\n",{"$f":"QA.4.3","v":0},0]
[{"$f":"Results!$B$2","v":0},"",{"$error":"#N/A"},{"$error":"#N/A"},{"$f":"Results!$B$6","v":0},null,{"$f":"CONCATENATE(Results!$C$4,\" - \",Results!$B$4)","v":"0 - 0"},{"$f":"CONCATENATE(Results!$C$5,\" - \",Results!$B$5)","v":"0 - 0"},false,"Stage1","OTHER COVERAGE SCHEME\n(add specific name in your country)","AVANTAGES / DROITS\nUne liste de services ou niveau de soins est-elle définie? Est-ce que les utilisateurs doivent faire des co-paiements?\n",{"$f":"QA.4.4","v":0},0]
[{"$f":"Results!$B$2","v":0},"",{"$error":"#N/A"},{"$error":"#N/A"},{"$f":"Results!$B$6","v":0},null,{"$f":"CONCATENATE(Results!$C$4,\" - \",Results!$B$4)","v":"0 - 0"},{"$f":"CONCATENATE(Results!$C$5,\" - \",Results!$B$5)","v":"0 - 0"},false,"Stage1","OTHER COVERAGE SCHEME\n(add specific name in your country)","SOURCES DE REVENUS\nD'où vient l'argent? Allocations / transferts budgétaires; contributions prépayées.\n",{"$f":"QA.4.5","v":0},0]
[{"$f":"Results!$B$2","v":0},"",{"$error":"#N/A"},{"$error":"#N/A"},{"$f":"Results!$B$6","v":0},null,{"$f":"CONCATENATE(Results!$C$4,\" - \",Results!$B$4)","v":"0 - 0"},{"$f":"CONCATENATE(Results!$C$5,\" - \",Results!$B$5)","v":"0 - 0"},false,"Stage1","OTHER COVERAGE SCHEME\n(add specific name in your country)","ACCORDS DE MISE EN COMMUN\nLe budget de la santé est-il alloué aux autorités régionales, existe-t-il un ou plusieurs fonds d '«assurance»?\n",{"$f":"QA.4.6","v":0},0]
[{"$f":"Results!$B$2","v":0},"",{"$error":"#N/A"},{"$error":"#N/A"},{"$f":"Results!$B$6","v":0},null,{"$f":"CONCATENATE(Results!$C$4,\" - \",Results!$B$4)","v":"0 - 0"},{"$f":"CONCATENATE(Results!$C$5,\" - \",Results!$B$5)","v":"0 - 0"},false,"Stage1","OTHER COVERAGE SCHEME\n(add specific name in your country)","MODALITES D'ACHAT\nDécrivez les arrangements de gestion et de gouvernance?\n",{"$f":"QA.4.7","v":0},0]
[{"$f":"Results!$B$2","v":0},"",{"$error":"#N/A"},{"$error":"#N/A"},{"$f":"Results!$B$6","v":0},null,{"$f":"CONCATENATE(Results!$C$4,\" - \",Results!$B$4)","v":"0 - 0"},{"$f":"CONCATENATE(Results!$C$5,\" - \",Results!$B$5)","v":"0 - 0"},false,"Stage1","OTHER COVERAGE SCHEME\n(add specific name in your country)","PAIEMENT DU FOURNISSEUR\nPar exemple. les entrées par ligne ou poste budgétaire; Ticket de soins/Service, paiement au cas par cas, capitation, basé sur performances?\n",{"$f":"QA.4.8","v":0},0]
[{"$f":"Results!$B$2","v":0},"",{"$error":"#N/A"},{"$error":"#N/A"},{"$f":"Results!$B$6","v":0},null,{"$f":"CONCATENATE(Results!$C$4,\" - \",Results!$B$4)","v":"0 - 0"},{"$f":"CONCATENATE(Results!$C$5,\" - \",Results!$B$5)","v":"0 - 0"},false,"Stage1","OTHER COVERAGE SCHEME\n(add specific name in your country)","PRESTATION DE SERVICES & CONTRACTUALISATION\nDe quels fournisseurs les services sont-ils achetés? Public-privé? Des contrats / accords de services sont-ils utilisés?\n",{"$f":"QA.4.9","v":0},0]
[{"$f":"Results!$B$2","v":0},"",{"$error":"#N/A"},{"$error":"#N/A"},{"$f":"Results!$B$6","v":0},null,{"$f":"CONCATENATE(Results!$C$4,\" - \",Results!$B$4)","v":"0 - 0"},{"$f":"CONCATENATE(Results!$C$5,\" - \",Results!$B$5)","v":"0 - 0"},false,"Stage1",{"$f":"Results!$F$63","v":"OTHER COVERAGE SCHEME\n(add specific name in your country)"},{"$f":"L79","v":"POPULATION CIBLE\nTous les citoyens sont-ils couverts ou un sous-groupe spécifique, par exemple moins de 5 ans, salariés?\n"},{"$f":"QA.5.1","v":0},0]
[{"$f":"Results!$B$2","v":0},"",{"$error":"#N/A"},{"$error":"#N/A"},{"$f":"Results!$B$6","v":0},null,{"$f":"CONCATENATE(Results!$C$4,\" - \",Results!$B$4)","v":"0 - 0"},{"$f":"CONCATENATE(Results!$C$5,\" - \",Results!$B$5)","v":"0 - 0"},false,"Stage1",{"$f":"K88","v":"OTHER COVERAGE SCHEME\n(add specific name in your country)"},"POPULATION COUVERTE / souscrite\nNombre réel relatif à la pop cible.\n",{"$f":"QA.5.2","v":0},0]
[{"$f":"Results!$B$2","v":0},"",{"$error":"#N/A"},{"$error":"#N/A"},{"$f":"Results!$B$6","v":0},null,{"$f":"CONCATENATE(Results!$C$4,\" - \",Results!$B$4)","v":"0 - 0"},{"$f":"CONCATENATE(Results!$C$5,\" - \",Results!$B$5)","v":"0 - 0"},false,"Stage1",{"$f":"K89","v":"OTHER COVERAGE SCHEME\n(add specific name in your country)"},"BASE DE COUVERTURE / SOUSCRIPTION\nPar exemple. obligatoire, automatique, volontaire\n",{"$f":"QA.5.3","v":0},0]
[{"$f":"Results!$B$2","v":0},"",{"$error":"#N/A"},{"$error":"#N/A"},{"$f":"Results!$B$6","v":0},null,{"$f":"CONCATENATE(Results!$C$4,\" - \",Results!$B$4)","v":"0 - 0"},{"$f":"CONCATENATE(Results!$C$5,\" - \",Results!$B$5)","v":"0 - 0"},false,"Stage1","OTHER COVERAGE SCHEME\n(add specific name in your country)","AVANTAGES / DROITS\nUne liste de services ou niveau de soins est-elle définie? Est-ce que les utilisateurs doivent faire des co-paiements?\n",{"$f":"QA.5.4","v":0},0]
[{"$f":"Results!$B$2","v":0},"",{"$error":"#N/A"},{"$error":"#N/A"},{"$f":"Results!$B$6","v":0},null,{"$f":"CONCATENATE(Results!$C$4,\" - \",Results!$B$4)","v":"0 - 0"},{"$f":"CONCATENATE(Results!$C$5,\" - \",Results!$B$5)","v":"0 - 0"},false,"Stage1","OTHER COVERAGE SCHEME\n(add specific name in your country)","SOURCES DE REVENUS\nD'où vient l'argent? Allocations / transferts budgétaires; contributions prépayées.\n",{"$f":"QA.5.5","v":0},0]
[{"$f":"Results!$B$2","v":0},"",{"$error":"#N/A"},{"$error":"#N/A"},{"$f":"Results!$B$6","v":0},null,{"$f":"CONCATENATE(Results!$C$4,\" - \",Results!$B$4)","v":"0 - 0"},{"$f":"CONCATENATE(Results!$C$5,\" - \",Results!$B$5)","v":"0 - 0"},false,"Stage1","OTHER COVERAGE SCHEME\n(add specific name in your country)","ACCORDS DE MISE EN COMMUN\nLe budget de la santé est-il alloué aux autorités régionales, existe-t-il un ou plusieurs fonds d '«assurance»?\n",{"$f":"QA.5.6","v":0},0]
[{"$f":"Results!$B$2","v":0},"",{"$error":"#N/A"},{"$error":"#N/A"},{"$f":"Results!$B$6","v":0},null,{"$f":"CONCATENATE(Results!$C$4,\" - \",Results!$B$4)","v":"0 - 0"},{"$f":"CONCATENATE(Results!$C$5,\" - \",Results!$B$5)","v":"0 - 0"},false,"Stage1","OTHER COVERAGE SCHEME\n(add specific name in your country)","MODALITES D'ACHAT\nDécrivez les arrangements de gestion et de gouvernance?\n",{"$f":"QA.5.7","v":0},0]
[{"$f":"Results!$B$2","v":0},"",{"$error":"#N/A"},{"$error":"#N/A"},{"$f":"Results!$B$6","v":0},null,{"$f":"CONCATENATE(Results!$C$4,\" - \",Results!$B$4)","v":"0 - 0"},{"$f":"CONCATENATE(Results!$C$5,\" - \",Results!$B$5)","v":"0 - 0"},false,"Stage1","OTHER COVERAGE SCHEME\n(add specific name in your country)","PAIEMENT DU FOURNISSEUR\nPar exemple. les entrées par ligne ou poste budgétaire; Ticket de soins/Service, paiement au cas par cas, capitation, basé sur performances?\n",{"$f":"QA.5.8","v":0},0]
[{"$f":"Results!$B$2","v":0},"",{"$error":"#N/A"},{"$error":"#N/A"},{"$f":"Results!$B$6","v":0},null,{"$f":"CONCATENATE(Results!$C$4,\" - \",Results!$B$4)","v":"0 - 0"},{"$f":"CONCATENATE(Results!$C$5,\" - \",Results!$B$5)","v":"0 - 0"},false,"Stage1","OTHER COVERAGE SCHEME\n(add specific name in your country)","PRESTATION DE SERVICES & CONTRACTUALISATION\nDe quels fournisseurs les services sont-ils achetés? Public-privé? Des contrats / accords de services sont-ils utilisés?\n",{"$f":"QA.5.9","v":0},0]
[{"$f":"Results!$B$2","v":0},"",{"$error":"#N/A"},{"$error":"#N/A"},{"$f":"Results!$B$6","v":0},null,{"$f":"CONCATENATE(Results!$C$4,\" - \",Results!$B$4)","v":"0 - 0"},{"$f":"CONCATENATE(Results!$C$5,\" - \",Results!$B$5)","v":"0 - 0"},false,"Stage1",{"$f":"Results!$G$63","v":"OTHER COVERAGE SCHEME\n(add specific name in your country)"},{"$f":"L88","v":"POPULATION CIBLE\nTous les citoyens sont-ils couverts ou un sous-groupe spécifique, par exemple moins de 5 ans, salariés?\n"},{"$f":"QA.6.1","v":0},0]
[{"$f":"Results!$B$2","v":0},"",{"$error":"#N/A"},{"$error":"#N/A"},{"$f":"Results!$B$6","v":0},null,{"$f":"CONCATENATE(Results!$C$4,\" - \",Results!$B$4)","v":"0 - 0"},{"$f":"CONCATENATE(Results!$C$5,\" - \",Results!$B$5)","v":"0 - 0"},false,"Stage1",{"$f":"K97","v":"OTHER COVERAGE SCHEME\n(add specific name in your country)"},"POPULATION COUVERTE / souscrite\nNombre réel relatif à la pop cible.\n",{"$f":"QA.6.2","v":0},0]
[{"$f":"Results!$B$2","v":0},"",{"$error":"#N/A"},{"$error":"#N/A"},{"$f":"Results!$B$6","v":0},null,{"$f":"CONCATENATE(Results!$C$4,\" - \",Results!$B$4)","v":"0 - 0"},{"$f":"CONCATENATE(Results!$C$5,\" - \",Results!$B$5)","v":"0 - 0"},false,"Stage1",{"$f":"K98","v":"OTHER COVERAGE SCHEME\n(add specific name in your country)"},"BASE DE COUVERTURE / SOUSCRIPTION\nPar exemple. obligatoire, automatique, volontaire\n",{"$f":"QA.6.3","v":0},0]
[{"$f":"Results!$B$2","v":0},"",{"$error":"#N/A"},{"$error":"#N/A"},{"$f":"Results!$B$6","v":0},null,{"$f":"CONCATENATE(Results!$C$4,\" - \",Results!$B$4)","v":"0 - 0"},{"$f":"CONCATENATE(Results!$C$5,\" - \",Results!$B$5)","v":"0 - 0"},false,"Stage1","OTHER COVERAGE SCHEME\n(add specific name in your country)","AVANTAGES / DROITS\nUne liste de services ou niveau de soins est-elle définie? Est-ce que les utilisateurs doivent faire des co-paiements?\n",{"$f":"QA.6.4","v":0},0]
[{"$f":"Results!$B$2","v":0},"",{"$error":"#N/A"},{"$error":"#N/A"},{"$f":"Results!$B$6","v":0},null,{"$f":"CONCATENATE(Results!$C$4,\" - \",Results!$B$4)","v":"0 - 0"},{"$f":"CONCATENATE(Results!$C$5,\" - \",Results!$B$5)","v":"0 - 0"},false,"Stage1","OTHER COVERAGE SCHEME\n(add specific name in your country)","SOURCES DE REVENUS\nD'où vient l'argent? Allocations / transferts budgétaires; contributions prépayées.\n",{"$f":"QA.6.5","v":0},0]
[{"$f":"Results!$B$2","v":0},"",{"$error":"#N/A"},{"$error":"#N/A"},{"$f":"Results!$B$6","v":0},null,{"$f":"CONCATENATE(Results!$C$4,\" - \",Results!$B$4)","v":"0 - 0"},{"$f":"CONCATENATE(Results!$C$5,\" - \",Results!$B$5)","v":"0 - 0"},false,"Stage1","OTHER COVERAGE SCHEME\n(add specific name in your country)","ACCORDS DE MISE EN COMMUN\nLe budget de la santé est-il alloué aux autorités régionales, existe-t-il un ou plusieurs fonds d '«assurance»?\n",{"$f":"QA.6.6","v":0},0]
[{"$f":"Results!$B$2","v":0},"",{"$error":"#N/A"},{"$error":"#N/A"},{"$f":"Results!$B$6","v":0},null,{"$f":"CONCATENATE(Results!$C$4,\" - \",Results!$B$4)","v":"0 - 0"},{"$f":"CONCATENATE(Results!$C$5,\" - \",Results!$B$5)","v":"0 - 0"},false,"Stage1","OTHER COVERAGE SCHEME\n(add specific name in your country)","MODALITES D'ACHAT\nDécrivez les arrangements de gestion et de gouvernance?\n",{"$f":"QA.6.7","v":0},0]
[{"$f":"Results!$B$2","v":0},{"$f":"code","v":""},{"$error":"#N/A"},{"$error":"#N/A"},{"$f":"Results!$B$6","v":0},null,{"$f":"CONCATENATE(Results!$C$4,\" - \",Results!$B$4)","v":"0 - 0"},{"$f":"CONCATENATE(Results!$C$5,\" - \",Results!$B$5)","v":"0 - 0"},false,"Stage1","OTHER COVERAGE SCHEME\n(add specific name in your country)","PAIEMENT DU FOURNISSEUR\nPar exemple. les entrées par ligne ou poste budgétaire; Ticket de soins/Service, paiement au cas par cas, capitation, basé sur performances?\n",{"$f":"QA.6.8","v":0},0]
[{"$f":"Results!$B$2","v":0},"",{"$error":"#N/A"},{"$error":"#N/A"},{"$f":"Results!$B$6","v":0},null,{"$f":"CONCATENATE(Results!$C$4,\" - \",Results!$B$4)","v":"0 - 0"},{"$f":"CONCATENATE(Results!$C$5,\" - \",Results!$B$5)","v":"0 - 0"},false,"Stage1","OTHER COVERAGE SCHEME\n(add specific name in your country)","PRESTATION DE SERVICES & CONTRACTUALISATION\nDe quels fournisseurs les services sont-ils achetés? Public-privé? Des contrats / accords de services sont-ils utilisés?\n",{"$f":"QA.6.9","v":0},0]
[{"$f":"Results!$B$2","v":0},"",{"$f":"C105","v":{"$error":"#N/A"}},{"$f":"D105","v":{"$error":"#N/A"}},{"$f":"Results!$B$6","v":0},null,{"$f":"CONCATENATE(Results!$C$4,\" - \",Results!$B$4)","v":"0 - 0"},{"$f":"CONCATENATE(Results!$C$5,\" - \",Results!$B$5)","v":"0 - 0"},{"$f":"Results!AZ7","v":false},{"$f":"Results!AU7","v":"Equity_in_resource_distribution"},{"$f":"Results!AV7","v":"Q3.2"},{"$f":"Results!AW7","v":"Dans le cadre du processus global d’élaboration et de planification de la mise en œuvre des politiques de financement de la santé, quelle est l’approche de votre pays en matière de dispositifs de mise en commun des ressources ?"},{"$f":"Results!AX7","v":""},{"$f":"Results!AY7","v":0}]
[{"$f":"Results!$B$2","v":0},"",{"$error":"#N/A"},{"$error":"#N/A"},{"$f":"Results!$B$6","v":0},null,{"$f":"CONCATENATE(Results!$C$4,\" - \",Results!$B$4)","v":"0 - 0"},{"$f":"CONCATENATE(Results!$C$5,\" - \",Results!$B$5)","v":"0 - 0"},{"$f":"Results!AZ8","v":false},{"$f":"Results!AU8","v":"Equity_in_resource_distribution"},{"$f":"Results!AV8","v":"Q3.3"},{"$f":"Results!AW8","v":"Dans quelle mesure la capacité de redistribution des fonds prépayés dans votre pays est-elle limitée par le cadre institutionnel du financement de la santé ?"},{"$f":"Results!AX8","v":""},{"$f":"Results!AY8","v":0}]
[{"$f":"Results!$B$2","v":0},"",{"$error":"#N/A"},{"$error":"#N/A"},{"$f":"Results!$B$6","v":0},null,{"$f":"CONCATENATE(Results!$C$4,\" - \",Results!$B$4)","v":"0 - 0"},{"$f":"CONCATENATE(Results!$C$5,\" - \",Results!$B$5)","v":"0 - 0"},{"$f":"Results!AZ9","v":false},{"$f":"Results!AU9","v":"Equity_in_resource_distribution"},{"$f":"Results!AV9","v":"Q3.4"},{"$f":"Results!AW9","v":"Y-a-il des mesures, dans la conception des prestations, le paiement des prestataires ou les systèmes sous-jacents non financiers, qui visent à contrecarrer les problèmes découlant de la fragmentation de l’architecture du financement de la santé ?"},{"$f":"Results!AX9","v":""},{"$f":"Results!AY9","v":0}]
[{"$f":"Results!$B$2","v":0},"",{"$error":"#N/A"},{"$error":"#N/A"},{"$f":"Results!$B$6","v":0},null,{"$f":"CONCATENATE(Results!$C$4,\" - \",Results!$B$4)","v":"0 - 0"},{"$f":"CONCATENATE(Results!$C$5,\" - \",Results!$B$5)","v":"0 - 0"},{"$f":"Results!AZ10","v":false},{"$f":"Results!AU10","v":"Equity_in_resource_distribution"},{"$f":"Results!AV10","v":"Q3.5"},{"$f":"Results!AW10","v":"Dans quelle mesure les différentes sources de revenus et de financement sont-elles organisées de manière complémentaire, afin de financer un paquet de prestations pour l’ensemble de la population ?"},{"$f":"Results!AX10","v":""},{"$f":"Results!AY10","v":0}]
[{"$f":"Results!$B$2","v":0},"",{"$error":"#N/A"},{"$error":"#N/A"},{"$f":"Results!$B$6","v":0},null,{"$f":"CONCATENATE(Results!$C$4,\" - \",Results!$B$4)","v":"0 - 0"},{"$f":"CONCATENATE(Results!$C$5,\" - \",Results!$B$5)","v":"0 - 0"},{"$f":"Results!AZ11","v":false},{"$f":"Results!AU11","v":"Equity_in_resource_distribution"},{"$f":"Results!AV11","v":"Q3.6"},{"$f":"Results!AW11","v":"Dans quelle mesure les dispositifs d’assurance-maladie volontaire sont-ils une source d’inégalités, créant des effets de contagion potentiellement néfastes pour l’ensemble du système de santé ?"},{"$f":"Results!AX11","v":""},{"$f":"Results!AY11","v":0}]
[{"$f":"Results!$B$2","v":0},"",{"$error":"#N/A"},{"$error":"#N/A"},{"$f":"Results!$B$6","v":0},null,{"$f":"CONCATENATE(Results!$C$4,\" - \",Results!$B$4)","v":"0 - 0"},{"$f":"CONCATENATE(Results!$C$5,\" - \",Results!$B$5)","v":"0 - 0"},{"$f":"Results!AZ12","v":false},{"$f":"Results!AU12","v":"Equity_in_resource_distribution"},{"$f":"Results!AV12","v":"Q4.1"},{"$f":"Results!AW12","v":"Dans quelle mesure les allocations de fonds aux acheteurs de niveau inférieur, par exemple les administrations locales, et/ou les taux de paiement aux prestataires sont-ils le reflet des besoins de santé de la population ?"},{"$f":"Results!AX12","v":""},{"$f":"Results!AY12","v":0}]
[{"$f":"Results!$B$2","v":0},"",{"$error":"#N/A"},{"$error":"#N/A"},{"$f":"Results!$B$6","v":0},null,{"$f":"CONCATENATE(Results!$C$4,\" - \",Results!$B$4)","v":"0 - 0"},{"$f":"CONCATENATE(Results!$C$5,\" - \",Results!$B$5)","v":"0 - 0"},{"$f":"Results!AZ13","v":false},{"$f":"Results!AU13","v":"Equity_in_resource_distribution"},{"$f":"Results!AV13","v":"Q4.2"},{"$f":"Results!AW13","v":"Dans quelle mesure les paiements des prestataires sont-ils harmonisés entre régimes/sources de revenus et entre secteurs public et privé, afin de garantir des incitations cohérentes aux prestataires ?"},{"$f":"Results!AX13","v":""},{"$f":"Results!AY13","v":0}]
[{"$f":"Results!$B$2","v":0},"",{"$error":"#N/A"},{"$error":"#N/A"},{"$f":"Results!$B$6","v":0},null,{"$f":"CONCATENATE(Results!$C$4,\" - \",Results!$B$4)","v":"0 - 0"},{"$f":"CONCATENATE(Results!$C$5,\" - \",Results!$B$5)","v":"0 - 0"},{"$f":"Results!AZ14","v":false},{"$f":"Results!AU14","v":"Equity_in_resource_distribution"},{"$f":"Results!AV14","v":"Q6.4"},{"$f":"Results!AW14","v":"Dans quelle mesure les allocations budgétaires annuelles en matière de santé sont alignées sur les priorités du secteur de la santé (niveau, structure, nature/objectif) ?"},{"$f":"Results!AX14","v":""},{"$f":"Results!AY14","v":0}]
[{"$f":"Results!$B$2","v":0},"",{"$error":"#N/A"},{"$error":"#N/A"},{"$f":"Results!$B$6","v":0},null,{"$f":"CONCATENATE(Results!$C$4,\" - \",Results!$B$4)","v":"0 - 0"},{"$f":"CONCATENATE(Results!$C$5,\" - \",Results!$B$5)","v":"0 - 0"},{"$f":"Results!AZ15","v":false},{"$f":"Results!AU15","v":"Equity_in_resource_distribution"},{"$f":"Results!AV15","v":"Q6.6"},{"$f":"Results!AW15","v":"Dans quelle mesure les transferts fiscaux sont conçus et mis en œuvre de sorte à améliorer l’équité de la distribution des ressources dans le secteur de la santé?"},{"$f":"Results!AX15","v":""},{"$f":"Results!AY15","v":0}]
[{"$f":"Results!$B$2","v":0},"",{"$error":"#N/A"},{"$error":"#N/A"},{"$f":"Results!$B$6","v":0},null,{"$f":"CONCATENATE(Results!$C$4,\" - \",Results!$B$4)","v":"0 - 0"},{"$f":"CONCATENATE(Results!$C$5,\" - \",Results!$B$5)","v":"0 - 0"},{"$f":"Results!AZ16","v":false},{"$f":"Results!AU16","v":"Equity_in_resource_distribution"},{"$f":"Results!AV16","v":"Q6.11"},{"$f":"Results!AW16","v":"Dans quelle mesure les flux financiers multiples, la structure budgétaire et les règles de GFP sont alignés sur les politiques d’achats stratégiques?"},{"$f":"Results!AX16","v":""},{"$f":"Results!AY16","v":0}]
[{"$f":"Results!$B$2","v":0},"",{"$error":"#N/A"},{"$error":"#N/A"},{"$f":"Results!$B$6","v":0},null,{"$f":"CONCATENATE(Results!$C$4,\" - \",Results!$B$4)","v":"0 - 0"},{"$f":"CONCATENATE(Results!$C$5,\" - \",Results!$B$5)","v":"0 - 0"},{"$f":"Results!AZ17","v":false},{"$f":"Results!AU17","v":"Efficiency"},{"$f":"Results!AV17","v":"Q2.4"},{"$f":"Results!AW17","v":"Dans quelle mesure le flux de fonds publics est-il stable, notamment grâce à une exécution budgétaire régulière, c’est-à-dire un déblocage des fonds dans les délais, conformément aux budgets de santé approuvés ?"},{"$f":"Results!AX17","v":""},{"$f":"Results!AY17","v":0}]
[{"$f":"Results!$B$2","v":0},"",{"$error":"#N/A"},{"$error":"#N/A"},{"$f":"Results!$B$6","v":0},null,{"$f":"CONCATENATE(Results!$C$4,\" - \",Results!$B$4)","v":"0 - 0"},{"$f":"CONCATENATE(Results!$C$5,\" - \",Results!$B$5)","v":"0 - 0"},{"$f":"Results!AZ18","v":false},{"$f":"Results!AU18","v":"Efficiency"},{"$f":"Results!AV18","v":"Q3.2"},{"$f":"Results!AW18","v":"Dans le cadre du processus global d’élaboration et de planification de la mise en œuvre des politiques de financement de la santé, quelle est l’approche de votre pays en matière de dispositifs de mise en commun des ressources ?"},{"$f":"Results!AX18","v":""},{"$f":"Results!AY18","v":0}]
[{"$f":"Results!$B$2","v":0},"",{"$error":"#N/A"},{"$error":"#N/A"},{"$f":"Results!$B$6","v":0},null,{"$f":"CONCATENATE(Results!$C$4,\" - \",Results!$B$4)","v":"0 - 0"},{"$f":"CONCATENATE(Results!$C$5,\" - \",Results!$B$5)","v":"0 - 0"},{"$f":"Results!AZ19","v":false},{"$f":"Results!AU19","v":"Efficiency"},{"$f":"Results!AV19","v":"Q3.3"},{"$f":"Results!AW19","v":"Dans quelle mesure la capacité de redistribution des fonds prépayés dans votre pays est-elle limitée par le cadre institutionnel du financement de la santé ?"},{"$f":"Results!AX19","v":""},{"$f":"Results!AY19","v":0}]
[{"$f":"Results!$B$2","v":0},"",{"$error":"#N/A"},{"$error":"#N/A"},{"$f":"Results!$B$6","v":0},null,{"$f":"CONCATENATE(Results!$C$4,\" - \",Results!$B$4)","v":"0 - 0"},{"$f":"CONCATENATE(Results!$C$5,\" - \",Results!$B$5)","v":"0 - 0"},{"$f":"Results!AZ20","v":false},{"$f":"Results!AU20","v":"Efficiency"},{"$f":"Results!AV20","v":"Q3.4"},{"$f":"Results!AW20","v":"Y-a-il des mesures, dans la conception des prestations, le paiement des prestataires ou les systèmes sous-jacents non financiers, qui visent à contrecarrer les problèmes découlant de la fragmentation de l’architecture du financement de la santé ?"},{"$f":"Results!AX20","v":""},{"$f":"Results!AY20","v":0}]
[{"$f":"Results!$B$2","v":0},"",{"$error":"#N/A"},{"$error":"#N/A"},{"$f":"Results!$B$6","v":0},null,{"$f":"CONCATENATE(Results!$C$4,\" - \",Results!$B$4)","v":"0 - 0"},{"$f":"CONCATENATE(Results!$C$5,\" - \",Results!$B$5)","v":"0 - 0"},{"$f":"Results!AZ21","v":false},{"$f":"Results!AU21","v":"Efficiency"},{"$f":"Results!AV21","v":"Q3.5"},{"$f":"Results!AW21","v":"Dans quelle mesure les différentes sources de revenus et de financement sont-elles organisées de manière complémentaire, afin de financer un paquet de prestations pour l’ensemble de la population ?"},{"$f":"Results!AX21","v":""},{"$f":"Results!AY21","v":0}]
[{"$f":"Results!$B$2","v":0},"",{"$error":"#N/A"},{"$error":"#N/A"},{"$f":"Results!$B$6","v":0},null,{"$f":"CONCATENATE(Results!$C$4,\" - \",Results!$B$4)","v":"0 - 0"},{"$f":"CONCATENATE(Results!$C$5,\" - \",Results!$B$5)","v":"0 - 0"},{"$f":"Results!AZ22","v":false},{"$f":"Results!AU22","v":"Efficiency"},{"$f":"Results!AV22","v":"Q3.7"},{"$f":"Results!AW22","v":"Dans quelle mesure les flux financiers sont-ils incohérents et redondants, et empêchent d’utiliser efficacement le budget public et les fonds des donateurs ?"},{"$f":"Results!AX22","v":""},{"$f":"Results!AY22","v":0}]
[{"$f":"Results!$B$2","v":0},"",{"$error":"#N/A"},{"$error":"#N/A"},{"$f":"Results!$B$6","v":0},null,{"$f":"CONCATENATE(Results!$C$4,\" - \",Results!$B$4)","v":"0 - 0"},{"$f":"CONCATENATE(Results!$C$5,\" - \",Results!$B$5)","v":"0 - 0"},{"$f":"Results!AZ23","v":false},{"$f":"Results!AU23","v":"Efficiency"},{"$f":"Results!AV23","v":"Q4.5"},{"$f":"Results!AW23","v":"Dans quelle mesure les méthodes de paiement des prestataires favorisent-elles l’efficacité de l’allocation des ressources, par exemple en réduisant la prestation excessive ou en augmentant celle insuffisante des services, et gèrent-elles la croissance des dépenses ?"},{"$f":"Results!AX23","v":""},{"$f":"Results!AY23","v":0}]
[{"$f":"Results!$B$2","v":0},"",{"$error":"#N/A"},{"$error":"#N/A"},{"$f":"Results!$B$6","v":0},null,{"$f":"CONCATENATE(Results!$C$4,\" - \",Results!$B$4)","v":"0 - 0"},{"$f":"CONCATENATE(Results!$C$5,\" - \",Results!$B$5)","v":"0 - 0"},{"$f":"Results!AZ24","v":false},{"$f":"Results!AU24","v":"Efficiency"},{"$f":"Results!AV24","v":"Q4.8"},{"$f":"Results!AW24","v":"Dans quelle mesure les prestataires jouissent-ils d’une autonomie financière et sont-ils tenus responsables, dans une mesure réaliste et conforme à leurs capacités ?"},{"$f":"Results!AX24","v":""},{"$f":"Results!AY24","v":0}]
[{"$f":"Results!$B$2","v":0},"",{"$error":"#N/A"},{"$error":"#N/A"},{"$f":"Results!$B$6","v":0},null,{"$f":"CONCATENATE(Results!$C$4,\" - \",Results!$B$4)","v":"0 - 0"},{"$f":"CONCATENATE(Results!$C$5,\" - \",Results!$B$5)","v":"0 - 0"},{"$f":"Results!AZ25","v":false},{"$f":"Results!AU25","v":"Efficiency"},{"$f":"Results!AV25","v":"Q4.9"},{"$f":"Results!AW25","v":"Dans quelle mesure l’accréditation des prestataires ou les contrats sélectifs sont-ils établis, fonctionnels et utilisés pour les achats ?"},{"$f":"Results!AX25","v":""},{"$f":"Results!AY25","v":0}]
[{"$f":"Results!$B$2","v":0},"",{"$error":"#N/A"},{"$error":"#N/A"},{"$f":"Results!$B$6","v":0},null,{"$f":"CONCATENATE(Results!$C$4,\" - \",Results!$B$4)","v":"0 - 0"},{"$f":"CONCATENATE(Results!$C$5,\" - \",Results!$B$5)","v":"0 - 0"},{"$f":"Results!AZ26","v":false},{"$f":"Results!AU26","v":"Efficiency"},{"$f":"Results!AV26","v":"Q4.10"},{"$f":"Results!AW26","v":"Dans quelle mesure l’achat et le paiement des produits pharmaceutiques sont-ils mis en œuvre pour promouvoir l’utilisation efficace des médicaments (par exemple le recours aux génériques plutôt qu’aux princeps) et pour améliorer la protection financière des patients ?"},{"$f":"Results!AX26","v":""},{"$f":"Results!AY26","v":0}]
[{"$f":"Results!$B$2","v":0},"",{"$error":"#N/A"},{"$error":"#N/A"},{"$f":"Results!$B$6","v":0},null,{"$f":"CONCATENATE(Results!$C$4,\" - \",Results!$B$4)","v":"0 - 0"},{"$f":"CONCATENATE(Results!$C$5,\" - \",Results!$B$5)","v":"0 - 0"},{"$f":"Results!AZ27","v":false},{"$f":"Results!AU27","v":"Efficiency"},{"$f":"Results!AV27","v":"Q6.7"},{"$f":"Results!AW27","v":"Dans quelle mesure les règles du budget de la santé permettent-elles une certaine souplesse des dépenses? "},{"$f":"Results!AX27","v":""},{"$f":"Results!AY27","v":0}]
[{"$f":"Results!$B$2","v":0},"",{"$error":"#N/A"},{"$error":"#N/A"},{"$f":"Results!$B$6","v":0},null,{"$f":"CONCATENATE(Results!$C$4,\" - \",Results!$B$4)","v":"0 - 0"},{"$f":"CONCATENATE(Results!$C$5,\" - \",Results!$B$5)","v":"0 - 0"},{"$f":"Results!AZ28","v":false},{"$f":"Results!AU28","v":"Efficiency"},{"$f":"Results!AV28","v":"Q6.8"},{"$f":"Results!AW28","v":"La flexibilité dans l’utilisation des ressources est-elle assurée ou déléguée au bon niveau?"},{"$f":"Results!AX28","v":""},{"$f":"Results!AY28","v":0}]
[{"$f":"Results!$B$2","v":0},"",{"$error":"#N/A"},{"$error":"#N/A"},{"$f":"Results!$B$6","v":0},null,{"$f":"CONCATENATE(Results!$C$4,\" - \",Results!$B$4)","v":"0 - 0"},{"$f":"CONCATENATE(Results!$C$5,\" - \",Results!$B$5)","v":"0 - 0"},{"$f":"Results!AZ29","v":false},{"$f":"Results!AU29","v":"Efficiency"},{"$f":"Results!AV29","v":"Q6.9"},{"$f":"Results!AW29","v":"Dans quelle mesure des politiques de discipline budgétaire visant à contrôler les dépenses sont en vigueur (par exemple, gestion de la trésorerie, respect des règles d’approvisionnement) et mises en œuvre efficacement?"},{"$f":"Results!AX29","v":""},{"$f":"Results!AY29","v":0}]
[{"$f":"Results!$B$2","v":0},"",{"$error":"#N/A"},{"$error":"#N/A"},{"$f":"Results!$B$6","v":0},null,{"$f":"CONCATENATE(Results!$C$4,\" - \",Results!$B$4)","v":"0 - 0"},{"$f":"CONCATENATE(Results!$C$5,\" - \",Results!$B$5)","v":"0 - 0"},{"$f":"Results!AZ30","v":false},{"$f":"Results!AU30","v":"Efficiency"},{"$f":"Results!AV30","v":"Q6.11"},{"$f":"Results!AW30","v":"Dans quelle mesure les flux financiers multiples, la structure budgétaire et les règles de GFP sont alignés sur les politiques d’achats stratégiques?"},{"$f":"Results!AX30","v":""},{"$f":"Results!AY30","v":0}]
[{"$f":"Results!$B$2","v":0},"",{"$error":"#N/A"},{"$error":"#N/A"},{"$f":"Results!$B$6","v":0},null,{"$f":"CONCATENATE(Results!$C$4,\" - \",Results!$B$4)","v":"0 - 0"},{"$f":"CONCATENATE(Results!$C$5,\" - \",Results!$B$5)","v":"0 - 0"},{"$f":"Results!AZ31","v":false},{"$f":"Results!AU31","v":"Transparency_accountability"},{"$f":"Results!AV31","v":"Q2.1"},{"$f":"Results!AW31","v":"Quelle approche est en vigueur dans votre pays en matière d’élaboration de politiques et de stratégies de collecte de revenus ? Cette approche s'inscrit-elle dans le cadre du processus global d’élaboration et de planification de la mise en œuvre des politiques de financement de la santé ?"},{"$f":"Results!AX31","v":""},{"$f":"Results!AY31","v":0}]
[{"$f":"Results!$B$2","v":0},"",{"$error":"#N/A"},{"$error":"#N/A"},{"$f":"Results!$B$6","v":0},null,{"$f":"CONCATENATE(Results!$C$4,\" - \",Results!$B$4)","v":"0 - 0"},{"$f":"CONCATENATE(Results!$C$5,\" - \",Results!$B$5)","v":"0 - 0"},{"$f":"Results!AZ32","v":false},{"$f":"Results!AU32","v":"Transparency_accountability"},{"$f":"Results!AV32","v":"Q2.3"},{"$f":"Results!AW32","v":"Dans quelle mesure le financement public de la santé dans votre pays est-il prédictible sur plusieurs années ?"},{"$f":"Results!AX32","v":""},{"$f":"Results!AY32","v":0}]
[{"$f":"Results!$B$2","v":0},"",{"$error":"#N/A"},{"$error":"#N/A"},{"$f":"Results!$B$6","v":0},null,{"$f":"CONCATENATE(Results!$C$4,\" - \",Results!$B$4)","v":"0 - 0"},{"$f":"CONCATENATE(Results!$C$5,\" - \",Results!$B$5)","v":"0 - 0"},{"$f":"Results!AZ33","v":false},{"$f":"Results!AU33","v":"Transparency_accountability"},{"$f":"Results!AV33","v":"Q4.4"},{"$f":"Results!AW33","v":"Dans quelle mesure les contrats d’achat précisent-ils des exigences en matière de qualité des soins, y compris la disponibilité et la pertinence des soins, puis vérifient-ils de façon régulière qu’elles sont bien respectées ?"},{"$f":"Results!AX33","v":""},{"$f":"Results!AY33","v":0}]
[{"$f":"Results!$B$2","v":0},"",{"$error":"#N/A"},{"$error":"#N/A"},{"$f":"Results!$B$6","v":0},null,{"$f":"CONCATENATE(Results!$C$4,\" - \",Results!$B$4)","v":"0 - 0"},{"$f":"CONCATENATE(Results!$C$5,\" - \",Results!$B$5)","v":"0 - 0"},{"$f":"Results!AZ34","v":false},{"$f":"Results!AU34","v":"Transparency_accountability"},{"$f":"Results!AV34","v":"Q4.8"},{"$f":"Results!AW34","v":"Dans quelle mesure les prestataires jouissent-ils d’une autonomie financière et sont-ils tenus responsables, dans une mesure réaliste et conforme à leurs capacités ?"},{"$f":"Results!AX34","v":""},{"$f":"Results!AY34","v":0}]
[{"$f":"Results!$B$2","v":0},"",{"$error":"#N/A"},{"$error":"#N/A"},{"$f":"Results!$B$6","v":0},null,{"$f":"CONCATENATE(Results!$C$4,\" - \",Results!$B$4)","v":"0 - 0"},{"$f":"CONCATENATE(Results!$C$5,\" - \",Results!$B$5)","v":"0 - 0"},{"$f":"Results!AZ35","v":false},{"$f":"Results!AU35","v":"Transparency_accountability"},{"$f":"Results!AV35","v":"Q5.2"},{"$f":"Results!AW35","v":"Dans quelle mesure les décisions et les révisions relatives aux prestations sont-elles prises de manière transparente, sur la base d’un processus clairement défini et de critères convenus, tels que le rapport coût-efficacité, la protection financière, l’impact budgétaire ?"},{"$f":"Results!AX35","v":""},{"$f":"Results!AY35","v":0}]
[{"$f":"Results!$B$2","v":0},"",{"$error":"#N/A"},{"$error":"#N/A"},{"$f":"Results!$B$6","v":0},null,{"$f":"CONCATENATE(Results!$C$4,\" - \",Results!$B$4)","v":"0 - 0"},{"$f":"CONCATENATE(Results!$C$5,\" - \",Results!$B$5)","v":"0 - 0"},{"$f":"Results!AZ36","v":false},{"$f":"Results!AU36","v":"Transparency_accountability"},{"$f":"Results!AV36","v":"Q5.5"},{"$f":"Results!AW36","v":"Dans quelle mesure les droits et obligations de la population sont-ils explicitement définis et compris par les intéressés ?"},{"$f":"Results!AX36","v":""},{"$f":"Results!AY36","v":0}]
[{"$f":"Results!$B$2","v":0},{"$f":"code","v":""},{"$error":"#N/A"},{"$error":"#N/A"},{"$f":"Results!$B$6","v":0},null,{"$f":"CONCATENATE(Results!$C$4,\" - \",Results!$B$4)","v":"0 - 0"},{"$f":"CONCATENATE(Results!$C$5,\" - \",Results!$B$5)","v":"0 - 0"},{"$f":"Results!AZ37","v":false},{"$f":"Results!AU37","v":"Transparency_accountability"},{"$f":"Results!AV37","v":"Q5.7"},{"$f":"Results!AW37","v":"Dans quelle mesure les prestations, y compris le partage des coûts pour les patients, sont-elles alignées sur les recettes, afin d’assurer un financement adéquat des droits à prestations approuvés ?"},{"$f":"Results!AX37","v":""},{"$f":"Results!AY37","v":0}]
[{"$f":"Results!$B$2","v":0},"",{"$error":"#N/A"},{"$error":"#N/A"},{"$f":"Results!$B$6","v":0},null,{"$f":"CONCATENATE(Results!$C$4,\" - \",Results!$B$4)","v":"0 - 0"},{"$f":"CONCATENATE(Results!$C$5,\" - \",Results!$B$5)","v":"0 - 0"},{"$f":"Results!AZ38","v":false},{"$f":"Results!AU38","v":"Transparency_accountability"},{"$f":"Results!AV38","v":"Q6.5"},{"$f":"Results!AW38","v":"Dans quelle mesure le processus budgétaire est consultatif, transparent et un processus d’examen et d’ajustement budgétaire à mi-parcours est établi ?"},{"$f":"Results!AX38","v":""},{"$f":"Results!AY38","v":0}]
[{"$f":"Results!$B$2","v":0},"",{"$error":"#N/A"},{"$error":"#N/A"},{"$f":"Results!$B$6","v":0},null,{"$f":"CONCATENATE(Results!$C$4,\" - \",Results!$B$4)","v":"0 - 0"},{"$f":"CONCATENATE(Results!$C$5,\" - \",Results!$B$5)","v":"0 - 0"},{"$f":"Results!AZ39","v":false},{"$f":"Results!AU39","v":"Transparency_accountability"},{"$f":"Results!AV39","v":"Q6.7"},{"$f":"Results!AW39","v":"Dans quelle mesure les règles du budget de la santé permettent-elles une certaine souplesse des dépenses? "},{"$f":"Results!AX39","v":""},{"$f":"Results!AY39","v":0}]
[{"$f":"Results!$B$2","v":0},"",{"$error":"#N/A"},{"$error":"#N/A"},{"$f":"Results!$B$6","v":0},null,{"$f":"CONCATENATE(Results!$C$4,\" - \",Results!$B$4)","v":"0 - 0"},{"$f":"CONCATENATE(Results!$C$5,\" - \",Results!$B$5)","v":"0 - 0"},{"$f":"Results!AZ40","v":false},{"$f":"Results!AU40","v":"Transparency_accountability"},{"$f":"Results!AV40","v":"Q6.9"},{"$f":"Results!AW40","v":"Dans quelle mesure des politiques de discipline budgétaire visant à contrôler les dépenses sont en vigueur (par exemple, gestion de la trésorerie, respect des règles d’approvisionnement) et mises en œuvre efficacement?"},{"$f":"Results!AX40","v":""},{"$f":"Results!AY40","v":0}]
[{"$f":"Results!$B$2","v":0},"",{"$error":"#N/A"},{"$error":"#N/A"},{"$f":"Results!$B$6","v":0},null,{"$f":"CONCATENATE(Results!$C$4,\" - \",Results!$B$4)","v":"0 - 0"},{"$f":"CONCATENATE(Results!$C$5,\" - \",Results!$B$5)","v":"0 - 0"},{"$f":"Results!AZ41","v":false},{"$f":"Results!AU41","v":"Transparency_accountability"},{"$f":"Results!AV41","v":"Q7.1"},{"$f":"Results!AW41","v":"Dans quelle mesure les rôles et les responsabilités (liés aux objectifs de financement de la santé et au rendement en matière de collecte de recettes, de mise en commun, d’achats, de prestations, etc.) sont clairement définis et répartis entre les institutions responsables du financement de la santé ?"},{"$f":"Results!AX41","v":""},{"$f":"Results!AY41","v":0}]
[{"$f":"Results!$B$2","v":0},"",{"$error":"#N/A"},{"$error":"#N/A"},{"$f":"Results!$B$6","v":0},null,{"$f":"CONCATENATE(Results!$C$4,\" - \",Results!$B$4)","v":"0 - 0"},{"$f":"CONCATENATE(Results!$C$5,\" - \",Results!$B$5)","v":"0 - 0"},{"$f":"Results!AZ42","v":false},{"$f":"Results!AU42","v":"Transparency_accountability"},{"$f":"Results!AV42","v":"Q7.2"},{"$f":"Results!AW42","v":"Dans quelle mesure les institutions responsables du financement de la santé disposent-elles de capacités adéquates, notamment en matière de ressources humaines (capacités techniques et managériales) et de TIC ?"},{"$f":"Results!AX42","v":""},{"$f":"Results!AY42","v":0}]
[{"$f":"Results!$B$2","v":0},"",{"$error":"#N/A"},{"$error":"#N/A"},{"$f":"Results!$B$6","v":0},null,{"$f":"CONCATENATE(Results!$C$4,\" - \",Results!$B$4)","v":"0 - 0"},{"$f":"CONCATENATE(Results!$C$5,\" - \",Results!$B$5)","v":"0 - 0"},{"$f":"Results!AZ43","v":false},{"$f":"Results!AU43","v":"Transparency_accountability"},{"$f":"Results!AV43","v":"Q7.3"},{"$f":"Results!AW43","v":"Dans quelle mesure les mécanismes de responsabilisation des organismes d’achat/de financement (y compris l’autonomie et le conseil d’administration de l’agence d’assurance-maladie, les mécanismes de récompense/sanction, etc.) sont-ils en place pour s’assurer que la politique de financement de la santé appuie les progrès vers les objectifs du secteur et que les fonds sont utilisés efficacement pour les populations, programmes et services prioritaires ?"},{"$f":"Results!AX43","v":""},{"$f":"Results!AY43","v":0}]
[{"$f":"Results!$B$2","v":0},"",{"$error":"#N/A"},{"$error":"#N/A"},{"$f":"Results!$B$6","v":0},null,{"$f":"CONCATENATE(Results!$C$4,\" - \",Results!$B$4)","v":"0 - 0"},{"$f":"CONCATENATE(Results!$C$5,\" - \",Results!$B$5)","v":"0 - 0"},{"$f":"Results!AZ44","v":false},{"$f":"Results!AU44","v":"Transparency_accountability"},{"$f":"Results!AV44","v":"Q7.4"},{"$f":"Results!AW44","v":"L’utilisation des fonds ou les performances des institutions achetant des services auprès des prestataires de services de santé ou le budget de la santé ont-ils été communiqués au public (par exemple sous forme de rapport annuel) ?"},{"$f":"Results!AX44","v":""},{"$f":"Results!AY44","v":0}]
[{"$f":"Results!$B$2","v":0},"",{"$error":"#N/A"},{"$error":"#N/A"},{"$f":"Results!$B$6","v":0},null,{"$f":"CONCATENATE(Results!$C$4,\" - \",Results!$B$4)","v":"0 - 0"},{"$f":"CONCATENATE(Results!$C$5,\" - \",Results!$B$5)","v":"0 - 0"},{"$f":"Results!AZ45","v":false},{"$f":"Results!AU45","v":"Transparency_accountability"},{"$f":"Results!AV45","v":"Q7.5"},{"$f":"Results!AW45","v":"Dans quelle mesure le Ministère des finances, le Ministère de la santé et l’organisme national d’assurance-maladie participent au processus d’élaboration des politiques de financement de la santé et en sont informés ?"},{"$f":"Results!AX45","v":""},{"$f":"Results!AY45","v":0}]
[{"$f":"Results!$B$2","v":0},"",{"$error":"#N/A"},{"$error":"#N/A"},{"$f":"Results!$B$6","v":0},null,{"$f":"CONCATENATE(Results!$C$4,\" - \",Results!$B$4)","v":"0 - 0"},{"$f":"CONCATENATE(Results!$C$5,\" - \",Results!$B$5)","v":"0 - 0"},{"$f":"Results!AZ46","v":false},{"$f":"Results!AU46","v":"Transparency_accountability"},{"$f":"Results!AV46","v":"Q7.6"},{"$f":"Results!AW46","v":"Dans quelle mesure le processus d’élaboration des politiques de financement de la santé est transparent et participatif?"},{"$f":"Results!AX46","v":""},{"$f":"Results!AY46","v":0}]
[{"$f":"Results!$B$2","v":0},"",{"$error":"#N/A"},{"$error":"#N/A"},{"$f":"Results!$B$6","v":0},null,{"$f":"CONCATENATE(Results!$C$4,\" - \",Results!$B$4)","v":"0 - 0"},{"$f":"CONCATENATE(Results!$C$5,\" - \",Results!$B$5)","v":"0 - 0"},{"$f":"Results!AZ47","v":false},{"$f":"Results!AU47","v":"Utilization_relative_need "},{"$f":"Results!AV47","v":"Q2.3"},{"$f":"Results!AW47","v":"Dans quelle mesure le financement public de la santé dans votre pays est-il prédictible sur plusieurs années ?"},{"$f":"Results!AX47","v":""},{"$f":"Results!AY47","v":0}]
[{"$f":"Results!$B$2","v":0},"",{"$error":"#N/A"},{"$error":"#N/A"},{"$f":"Results!$B$6","v":0},null,{"$f":"CONCATENATE(Results!$C$4,\" - \",Results!$B$4)","v":"0 - 0"},{"$f":"CONCATENATE(Results!$C$5,\" - \",Results!$B$5)","v":"0 - 0"},{"$f":"Results!AZ48","v":false},{"$f":"Results!AU48","v":"Utilization_relative_need "},{"$f":"Results!AV48","v":"Q2.4"},{"$f":"Results!AW48","v":"Dans quelle mesure le flux de fonds publics est-il stable, notamment grâce à une exécution budgétaire régulière, c’est-à-dire un déblocage des fonds dans les délais, conformément aux budgets de santé approuvés ?"},{"$f":"Results!AX48","v":""},{"$f":"Results!AY48","v":0}]
[{"$f":"Results!$B$2","v":0},"",{"$error":"#N/A"},{"$error":"#N/A"},{"$f":"Results!$B$6","v":0},null,{"$f":"CONCATENATE(Results!$C$4,\" - \",Results!$B$4)","v":"0 - 0"},{"$f":"CONCATENATE(Results!$C$5,\" - \",Results!$B$5)","v":"0 - 0"},{"$f":"Results!AZ49","v":false},{"$f":"Results!AU49","v":"Utilization_relative_need "},{"$f":"Results!AV49","v":"Q2.5"},{"$f":"Results!AW49","v":"Dans quelle mesure les différentes sources de revenus sont-elles collectées de façon progressive (c.-à-d. en fonction de la capacité de payer), et partant de là favorisent l’équité dans le mode de financement du système de santé ?"},{"$f":"Results!AX49","v":""},{"$f":"Results!AY49","v":0}]
[{"$f":"Results!$B$2","v":0},"",{"$error":"#N/A"},{"$error":"#N/A"},{"$f":"Results!$B$6","v":0},null,{"$f":"CONCATENATE(Results!$C$4,\" - \",Results!$B$4)","v":"0 - 0"},{"$f":"CONCATENATE(Results!$C$5,\" - \",Results!$B$5)","v":"0 - 0"},{"$f":"Results!AZ50","v":false},{"$f":"Results!AU50","v":"Utilization_relative_need "},{"$f":"Results!AV50","v":"Q3.2"},{"$f":"Results!AW50","v":"Dans le cadre du processus global d’élaboration et de planification de la mise en œuvre des politiques de financement de la santé, quelle est l’approche de votre pays en matière de dispositifs de mise en commun des ressources ?"},{"$f":"Results!AX50","v":""},{"$f":"Results!AY50","v":0}]
[{"$f":"Results!$B$2","v":0},"",{"$error":"#N/A"},{"$error":"#N/A"},{"$f":"Results!$B$6","v":0},null,{"$f":"CONCATENATE(Results!$C$4,\" - \",Results!$B$4)","v":"0 - 0"},{"$f":"CONCATENATE(Results!$C$5,\" - \",Results!$B$5)","v":"0 - 0"},{"$f":"Results!AZ51","v":false},{"$f":"Results!AU51","v":"Utilization_relative_need "},{"$f":"Results!AV51","v":"Q3.3"},{"$f":"Results!AW51","v":"Dans quelle mesure la capacité de redistribution des fonds prépayés dans votre pays est-elle limitée par le cadre institutionnel du financement de la santé ?"},{"$f":"Results!AX51","v":""},{"$f":"Results!AY51","v":0}]
[{"$f":"Results!$B$2","v":0},"",{"$error":"#N/A"},{"$error":"#N/A"},{"$f":"Results!$B$6","v":0},null,{"$f":"CONCATENATE(Results!$C$4,\" - \",Results!$B$4)","v":"0 - 0"},{"$f":"CONCATENATE(Results!$C$5,\" - \",Results!$B$5)","v":"0 - 0"},{"$f":"Results!AZ52","v":false},{"$f":"Results!AU52","v":"Utilization_relative_need "},{"$f":"Results!AV52","v":"Q3.4"},{"$f":"Results!AW52","v":"Y-a-il des mesures, dans la conception des prestations, le paiement des prestataires ou les systèmes sous-jacents non financiers, qui visent à contrecarrer les problèmes découlant de la fragmentation de l’architecture du financement de la santé ?"},{"$f":"Results!AX52","v":""},{"$f":"Results!AY52","v":0}]
[{"$f":"Results!$B$2","v":0},"",{"$error":"#N/A"},{"$error":"#N/A"},{"$f":"Results!$B$6","v":0},null,{"$f":"CONCATENATE(Results!$C$4,\" - \",Results!$B$4)","v":"0 - 0"},{"$f":"CONCATENATE(Results!$C$5,\" - \",Results!$B$5)","v":"0 - 0"},{"$f":"Results!AZ53","v":false},{"$f":"Results!AU53","v":"Utilization_relative_need "},{"$f":"Results!AV53","v":"Q3.5"},{"$f":"Results!AW53","v":"Dans quelle mesure les différentes sources de revenus et de financement sont-elles organisées de manière complémentaire, afin de financer un paquet de prestations pour l’ensemble de la population ?"},{"$f":"Results!AX53","v":""},{"$f":"Results!AY53","v":0}]
[{"$f":"Results!$B$2","v":0},"",{"$error":"#N/A"},{"$error":"#N/A"},{"$f":"Results!$B$6","v":0},null,{"$f":"CONCATENATE(Results!$C$4,\" - \",Results!$B$4)","v":"0 - 0"},{"$f":"CONCATENATE(Results!$C$5,\" - \",Results!$B$5)","v":"0 - 0"},{"$f":"Results!AZ54","v":false},{"$f":"Results!AU54","v":"Utilization_relative_need "},{"$f":"Results!AV54","v":"Q4.1"},{"$f":"Results!AW54","v":"Dans quelle mesure les allocations de fonds aux acheteurs de niveau inférieur, par exemple les administrations locales, et/ou les taux de paiement aux prestataires sont-ils le reflet des besoins de santé de la population ?"},{"$f":"Results!AX54","v":""},{"$f":"Results!AY54","v":0}]
[{"$f":"Results!$B$2","v":0},"",{"$error":"#N/A"},{"$error":"#N/A"},{"$f":"Results!$B$6","v":0},null,{"$f":"CONCATENATE(Results!$C$4,\" - \",Results!$B$4)","v":"0 - 0"},{"$f":"CONCATENATE(Results!$C$5,\" - \",Results!$B$5)","v":"0 - 0"},{"$f":"Results!AZ55","v":false},{"$f":"Results!AU55","v":"Utilization_relative_need "},{"$f":"Results!AV55","v":"Q5.3"},{"$f":"Results!AW55","v":"Dans quelle mesure les droits à prestation reflètent-ils explicitement les besoins de santé de la population ?"},{"$f":"Results!AX55","v":""},{"$f":"Results!AY55","v":0}]
[{"$f":"Results!$B$2","v":0},"",{"$error":"#N/A"},{"$error":"#N/A"},{"$f":"Results!$B$6","v":0},null,{"$f":"CONCATENATE(Results!$C$4,\" - \",Results!$B$4)","v":"0 - 0"},{"$f":"CONCATENATE(Results!$C$5,\" - \",Results!$B$5)","v":"0 - 0"},{"$f":"Results!AZ56","v":false},{"$f":"Results!AU56","v":"Utilization_relative_need "},{"$f":"Results!AV56","v":"Q5.4"},{"$f":"Results!AW56","v":"Dans quelle mesure les prestations accordent-elles la priorité aux catégories de population prioritaires, par exemple pour une meilleure utilisation des services hautement prioritaires et pour la protection financière ?"},{"$f":"Results!AX56","v":""},{"$f":"Results!AY56","v":0}]
[{"$f":"Results!$B$2","v":0},"",{"$error":"#N/A"},{"$error":"#N/A"},{"$f":"Results!$B$6","v":0},null,{"$f":"CONCATENATE(Results!$C$4,\" - \",Results!$B$4)","v":"0 - 0"},{"$f":"CONCATENATE(Results!$C$5,\" - \",Results!$B$5)","v":"0 - 0"},{"$f":"Results!AZ57","v":false},{"$f":"Results!AU57","v":"Utilization_relative_need "},{"$f":"Results!AV57","v":"Q5.5"},{"$f":"Results!AW57","v":"Dans quelle mesure les droits et obligations de la population sont-ils explicitement définis et compris par les intéressés ?"},{"$f":"Results!AX57","v":""},{"$f":"Results!AY57","v":0}]
[{"$f":"Results!$B$2","v":0},"",{"$error":"#N/A"},{"$error":"#N/A"},{"$f":"Results!$B$6","v":0},null,{"$f":"CONCATENATE(Results!$C$4,\" - \",Results!$B$4)","v":"0 - 0"},{"$f":"CONCATENATE(Results!$C$5,\" - \",Results!$B$5)","v":"0 - 0"},{"$f":"Results!AZ58","v":false},{"$f":"Results!AU58","v":"Utilization_relative_need "},{"$f":"Results!AV58","v":"Q5.6"},{"$f":"Results!AW58","v":"Dans quelle mesure les prestations sont-elles alignées sur le paiement des prestataires, afin de s’assurer qu’elles sont fournies et que les patients bénéficient d’une protection financière ?"},{"$f":"Results!AX58","v":""},{"$f":"Results!AY58","v":0}]
[{"$f":"Results!$B$2","v":0},"",{"$error":"#N/A"},{"$error":"#N/A"},{"$f":"Results!$B$6","v":0},null,{"$f":"CONCATENATE(Results!$C$4,\" - \",Results!$B$4)","v":"0 - 0"},{"$f":"CONCATENATE(Results!$C$5,\" - \",Results!$B$5)","v":"0 - 0"},{"$f":"Results!AZ59","v":false},{"$f":"Results!AU59","v":"Utilization_relative_need "},{"$f":"Results!AV59","v":"Q5.7"},{"$f":"Results!AW59","v":"Dans quelle mesure les prestations, y compris le partage des coûts pour les patients, sont-elles alignées sur les recettes, afin d’assurer un financement adéquat des droits à prestations approuvés ?"},{"$f":"Results!AX59","v":""},{"$f":"Results!AY59","v":0}]
[{"$f":"Results!$B$2","v":0},"",{"$error":"#N/A"},{"$error":"#N/A"},{"$f":"Results!$B$6","v":0},null,{"$f":"CONCATENATE(Results!$C$4,\" - \",Results!$B$4)","v":"0 - 0"},{"$f":"CONCATENATE(Results!$C$5,\" - \",Results!$B$5)","v":"0 - 0"},{"$f":"Results!AZ60","v":false},{"$f":"Results!AU60","v":"Utilization_relative_need "},{"$f":"Results!AV60","v":"Q6.4"},{"$f":"Results!AW60","v":"Dans quelle mesure les allocations budgétaires annuelles en matière de santé sont alignées sur les priorités du secteur de la santé (niveau, structure, nature/objectif) ?"},{"$f":"Results!AX60","v":""},{"$f":"Results!AY60","v":0}]
[{"$f":"Results!$B$2","v":0},"",{"$error":"#N/A"},{"$error":"#N/A"},{"$f":"Results!$B$6","v":0},null,{"$f":"CONCATENATE(Results!$C$4,\" - \",Results!$B$4)","v":"0 - 0"},{"$f":"CONCATENATE(Results!$C$5,\" - \",Results!$B$5)","v":"0 - 0"},{"$f":"Results!AZ61","v":false},{"$f":"Results!AU61","v":"Utilization_relative_need "},{"$f":"Results!AV61","v":"Q6.6"},{"$f":"Results!AW61","v":"Dans quelle mesure les transferts fiscaux sont conçus et mis en œuvre de sorte à améliorer l’équité de la distribution des ressources dans le secteur de la santé?"},{"$f":"Results!AX61","v":""},{"$f":"Results!AY61","v":0}]
[{"$f":"Results!$B$2","v":0},"",{"$error":"#N/A"},{"$error":"#N/A"},{"$f":"Results!$B$6","v":0},null,{"$f":"CONCATENATE(Results!$C$4,\" - \",Results!$B$4)","v":"0 - 0"},{"$f":"CONCATENATE(Results!$C$5,\" - \",Results!$B$5)","v":"0 - 0"},{"$f":"Results!AZ62","v":false},{"$f":"Results!AU62","v":"Utilization_relative_need "},{"$f":"Results!AV62","v":"Q6.7"},{"$f":"Results!AW62","v":"Dans quelle mesure les règles du budget de la santé permettent-elles une certaine souplesse des dépenses? "},{"$f":"Results!AX62","v":""},{"$f":"Results!AY62","v":0}]
[{"$f":"Results!$B$2","v":0},"",{"$error":"#N/A"},{"$error":"#N/A"},{"$f":"Results!$B$6","v":0},null,{"$f":"CONCATENATE(Results!$C$4,\" - \",Results!$B$4)","v":"0 - 0"},{"$f":"CONCATENATE(Results!$C$5,\" - \",Results!$B$5)","v":"0 - 0"},{"$f":"Results!AZ63","v":false},{"$f":"Results!AU63","v":"Utilization_relative_need "},{"$f":"Results!AV63","v":"Q6.11"},{"$f":"Results!AW63","v":"Dans quelle mesure les flux financiers multiples, la structure budgétaire et les règles de GFP sont alignés sur les politiques d’achats stratégiques?"},{"$f":"Results!AX63","v":""},{"$f":"Results!AY63","v":0}]
[{"$f":"Results!$B$2","v":0},"",{"$error":"#N/A"},{"$error":"#N/A"},{"$f":"Results!$B$6","v":0},null,{"$f":"CONCATENATE(Results!$C$4,\" - \",Results!$B$4)","v":"0 - 0"},{"$f":"CONCATENATE(Results!$C$5,\" - \",Results!$B$5)","v":"0 - 0"},{"$f":"Results!AZ64","v":false},{"$f":"Results!AU64","v":"Financial_protection "},{"$f":"Results!AV64","v":"Q2.1"},{"$f":"Results!AW64","v":"Quelle approche est en vigueur dans votre pays en matière d’élaboration de politiques et de stratégies de collecte de revenus ? Cette approche s'inscrit-elle dans le cadre du processus global d’élaboration et de planification de la mise en œuvre des politiques de financement de la santé ?"},{"$f":"Results!AX64","v":""},{"$f":"Results!AY64","v":0}]
[{"$f":"Results!$B$2","v":0},"",{"$error":"#N/A"},{"$error":"#N/A"},{"$f":"Results!$B$6","v":0},null,{"$f":"CONCATENATE(Results!$C$4,\" - \",Results!$B$4)","v":"0 - 0"},{"$f":"CONCATENATE(Results!$C$5,\" - \",Results!$B$5)","v":"0 - 0"},{"$f":"Results!AZ65","v":false},{"$f":"Results!AU65","v":"Financial_protection "},{"$f":"Results!AV65","v":"Q2.2"},{"$f":"Results!AW65","v":"Dans quelle mesure le financement de la santé dans votre pays repose-t-il sur des sources de financement public/obligatoire (par exemple, fiscalité/recettes publiques, y compris les cotisations obligatoires à l’assurance-maladie nationale/sociale) ?"},{"$f":"Results!AX65","v":""},{"$f":"Results!AY65","v":0}]
[{"$f":"Results!$B$2","v":0},"",{"$error":"#N/A"},{"$error":"#N/A"},{"$f":"Results!$B$6","v":0},null,{"$f":"CONCATENATE(Results!$C$4,\" - \",Results!$B$4)","v":"0 - 0"},{"$f":"CONCATENATE(Results!$C$5,\" - \",Results!$B$5)","v":"0 - 0"},{"$f":"Results!AZ66","v":false},{"$f":"Results!AU66","v":"Financial_protection "},{"$f":"Results!AV66","v":"Q2.4"},{"$f":"Results!AW66","v":"Dans quelle mesure le flux de fonds publics est-il stable, notamment grâce à une exécution budgétaire régulière, c’est-à-dire un déblocage des fonds dans les délais, conformément aux budgets de santé approuvés ?"},{"$f":"Results!AX66","v":""},{"$f":"Results!AY66","v":0}]
[{"$f":"Results!$B$2","v":0},"",{"$error":"#N/A"},{"$error":"#N/A"},{"$f":"Results!$B$6","v":0},null,{"$f":"CONCATENATE(Results!$C$4,\" - \",Results!$B$4)","v":"0 - 0"},{"$f":"CONCATENATE(Results!$C$5,\" - \",Results!$B$5)","v":"0 - 0"},{"$f":"Results!AZ67","v":false},{"$f":"Results!AU67","v":"Financial_protection "},{"$f":"Results!AV67","v":"Q2.5"},{"$f":"Results!AW67","v":"Dans quelle mesure les différentes sources de revenus sont-elles collectées de façon progressive (c.-à-d. en fonction de la capacité de payer), et partant de là favorisent l’équité dans le mode de financement du système de santé ?"},{"$f":"Results!AX67","v":""},{"$f":"Results!AY67","v":0}]
[{"$f":"Results!$B$2","v":0},"",{"$error":"#N/A"},{"$error":"#N/A"},{"$f":"Results!$B$6","v":0},null,{"$f":"CONCATENATE(Results!$C$4,\" - \",Results!$B$4)","v":"0 - 0"},{"$f":"CONCATENATE(Results!$C$5,\" - \",Results!$B$5)","v":"0 - 0"},{"$f":"Results!AZ68","v":false},{"$f":"Results!AU68","v":"Financial_protection "},{"$f":"Results!AV68","v":"Q3.2"},{"$f":"Results!AW68","v":"Dans le cadre du processus global d’élaboration et de planification de la mise en œuvre des politiques de financement de la santé, quelle est l’approche de votre pays en matière de dispositifs de mise en commun des ressources ?"},{"$f":"Results!AX68","v":""},{"$f":"Results!AY68","v":0}]
[{"$f":"Results!$B$2","v":0},{"$f":"code","v":""},{"$error":"#N/A"},{"$error":"#N/A"},{"$f":"Results!$B$6","v":0},null,{"$f":"CONCATENATE(Results!$C$4,\" - \",Results!$B$4)","v":"0 - 0"},{"$f":"CONCATENATE(Results!$C$5,\" - \",Results!$B$5)","v":"0 - 0"},{"$f":"Results!AZ69","v":false},{"$f":"Results!AU69","v":"Financial_protection "},{"$f":"Results!AV69","v":"Q3.3"},{"$f":"Results!AW69","v":"Dans quelle mesure la capacité de redistribution des fonds prépayés dans votre pays est-elle limitée par le cadre institutionnel du financement de la santé ?"},{"$f":"Results!AX69","v":""},{"$f":"Results!AY69","v":0}]
[{"$f":"Results!$B$2","v":0},"",{"$error":"#N/A"},{"$error":"#N/A"},{"$f":"Results!$B$6","v":0},null,{"$f":"CONCATENATE(Results!$C$4,\" - \",Results!$B$4)","v":"0 - 0"},{"$f":"CONCATENATE(Results!$C$5,\" - \",Results!$B$5)","v":"0 - 0"},{"$f":"Results!AZ70","v":false},{"$f":"Results!AU70","v":"Financial_protection "},{"$f":"Results!AV70","v":"Q3.4"},{"$f":"Results!AW70","v":"Y-a-il des mesures, dans la conception des prestations, le paiement des prestataires ou les systèmes sous-jacents non financiers, qui visent à contrecarrer les problèmes découlant de la fragmentation de l’architecture du financement de la santé ?"},{"$f":"Results!AX70","v":""},{"$f":"Results!AY70","v":0}]
[{"$f":"Results!$B$2","v":0},"",{"$f":"C169","v":{"$error":"#N/A"}},{"$f":"D169","v":{"$error":"#N/A"}},{"$f":"Results!$B$6","v":0},null,{"$f":"CONCATENATE(Results!$C$4,\" - \",Results!$B$4)","v":"0 - 0"},{"$f":"CONCATENATE(Results!$C$5,\" - \",Results!$B$5)","v":"0 - 0"},{"$f":"Results!AZ71","v":false},{"$f":"Results!AU71","v":"Financial_protection "},{"$f":"Results!AV71","v":"Q3.5"},{"$f":"Results!AW71","v":"Dans quelle mesure les différentes sources de revenus et de financement sont-elles organisées de manière complémentaire, afin de financer un paquet de prestations pour l’ensemble de la population ?"},{"$f":"Results!AX71","v":""},{"$f":"Results!AY71","v":0}]
[{"$f":"Results!$B$2","v":0},"",{"$error":"#N/A"},{"$error":"#N/A"},{"$f":"Results!$B$6","v":0},null,{"$f":"CONCATENATE(Results!$C$4,\" - \",Results!$B$4)","v":"0 - 0"},{"$f":"CONCATENATE(Results!$C$5,\" - \",Results!$B$5)","v":"0 - 0"},{"$f":"Results!AZ72","v":false},{"$f":"Results!AU72","v":"Financial_protection "},{"$f":"Results!AV72","v":"Q3.6"},{"$f":"Results!AW72","v":"Dans quelle mesure les dispositifs d’assurance-maladie volontaire sont-ils une source d’inégalités, créant des effets de contagion potentiellement néfastes pour l’ensemble du système de santé ?"},{"$f":"Results!AX72","v":""},{"$f":"Results!AY72","v":0}]
[{"$f":"Results!$B$2","v":0},"",{"$error":"#N/A"},{"$error":"#N/A"},{"$f":"Results!$B$6","v":0},null,{"$f":"CONCATENATE(Results!$C$4,\" - \",Results!$B$4)","v":"0 - 0"},{"$f":"CONCATENATE(Results!$C$5,\" - \",Results!$B$5)","v":"0 - 0"},{"$f":"Results!AZ73","v":false},{"$f":"Results!AU73","v":"Financial_protection "},{"$f":"Results!AV73","v":"Q4.10"},{"$f":"Results!AW73","v":"Dans quelle mesure l’achat et le paiement des produits pharmaceutiques sont-ils mis en œuvre pour promouvoir l’utilisation efficace des médicaments (par exemple le recours aux génériques plutôt qu’aux princeps) et pour améliorer la protection financière des patients ?"},{"$f":"Results!AX73","v":""},{"$f":"Results!AY73","v":0}]
[{"$f":"Results!$B$2","v":0},"",{"$error":"#N/A"},{"$error":"#N/A"},{"$f":"Results!$B$6","v":0},null,{"$f":"CONCATENATE(Results!$C$4,\" - \",Results!$B$4)","v":"0 - 0"},{"$f":"CONCATENATE(Results!$C$5,\" - \",Results!$B$5)","v":"0 - 0"},{"$f":"Results!AZ74","v":false},{"$f":"Results!AU74","v":"Financial_protection "},{"$f":"Results!AV74","v":"Q5.4"},{"$f":"Results!AW74","v":"Dans quelle mesure les prestations accordent-elles la priorité aux catégories de population prioritaires, par exemple pour une meilleure utilisation des services hautement prioritaires et pour la protection financière ?"},{"$f":"Results!AX74","v":""},{"$f":"Results!AY74","v":0}]
[{"$f":"Results!$B$2","v":0},"",{"$error":"#N/A"},{"$error":"#N/A"},{"$f":"Results!$B$6","v":0},null,{"$f":"CONCATENATE(Results!$C$4,\" - \",Results!$B$4)","v":"0 - 0"},{"$f":"CONCATENATE(Results!$C$5,\" - \",Results!$B$5)","v":"0 - 0"},{"$f":"Results!AZ75","v":false},{"$f":"Results!AU75","v":"Financial_protection "},{"$f":"Results!AV75","v":"Q5.6"},{"$f":"Results!AW75","v":"Dans quelle mesure les prestations sont-elles alignées sur le paiement des prestataires, afin de s’assurer qu’elles sont fournies et que les patients bénéficient d’une protection financière ?"},{"$f":"Results!AX75","v":""},{"$f":"Results!AY75","v":0}]
[{"$f":"Results!$B$2","v":0},"",{"$error":"#N/A"},{"$error":"#N/A"},{"$f":"Results!$B$6","v":0},null,{"$f":"CONCATENATE(Results!$C$4,\" - \",Results!$B$4)","v":"0 - 0"},{"$f":"CONCATENATE(Results!$C$5,\" - \",Results!$B$5)","v":"0 - 0"},{"$f":"Results!AZ76","v":false},{"$f":"Results!AU76","v":"Equity_finance "},{"$f":"Results!AV76","v":"Q2.1"},{"$f":"Results!AW76","v":"Quelle approche est en vigueur dans votre pays en matière d’élaboration de politiques et de stratégies de collecte de revenus ? Cette approche s'inscrit-elle dans le cadre du processus global d’élaboration et de planification de la mise en œuvre des politiques de financement de la santé ?"},{"$f":"Results!AX76","v":""},{"$f":"Results!AY76","v":0}]
[{"$f":"Results!$B$2","v":0},"",{"$error":"#N/A"},{"$error":"#N/A"},{"$f":"Results!$B$6","v":0},null,{"$f":"CONCATENATE(Results!$C$4,\" - \",Results!$B$4)","v":"0 - 0"},{"$f":"CONCATENATE(Results!$C$5,\" - \",Results!$B$5)","v":"0 - 0"},{"$f":"Results!AZ77","v":false},{"$f":"Results!AU77","v":"Equity_finance "},{"$f":"Results!AV77","v":"Q2.2"},{"$f":"Results!AW77","v":"Dans quelle mesure le financement de la santé dans votre pays repose-t-il sur des sources de financement public/obligatoire (par exemple, fiscalité/recettes publiques, y compris les cotisations obligatoires à l’assurance-maladie nationale/sociale) ?"},{"$f":"Results!AX77","v":""},{"$f":"Results!AY77","v":0}]
[{"$f":"Results!$B$2","v":0},"",{"$error":"#N/A"},{"$error":"#N/A"},{"$f":"Results!$B$6","v":0},null,{"$f":"CONCATENATE(Results!$C$4,\" - \",Results!$B$4)","v":"0 - 0"},{"$f":"CONCATENATE(Results!$C$5,\" - \",Results!$B$5)","v":"0 - 0"},{"$f":"Results!AZ78","v":false},{"$f":"Results!AU78","v":"Equity_finance "},{"$f":"Results!AV78","v":"Q2.4"},{"$f":"Results!AW78","v":"Dans quelle mesure le flux de fonds publics est-il stable, notamment grâce à une exécution budgétaire régulière, c’est-à-dire un déblocage des fonds dans les délais, conformément aux budgets de santé approuvés ?"},{"$f":"Results!AX78","v":""},{"$f":"Results!AY78","v":0}]
[{"$f":"Results!$B$2","v":0},"",{"$error":"#N/A"},{"$error":"#N/A"},{"$f":"Results!$B$6","v":0},null,{"$f":"CONCATENATE(Results!$C$4,\" - \",Results!$B$4)","v":"0 - 0"},{"$f":"CONCATENATE(Results!$C$5,\" - \",Results!$B$5)","v":"0 - 0"},{"$f":"Results!AZ79","v":false},{"$f":"Results!AU79","v":"Equity_finance "},{"$f":"Results!AV79","v":"Q2.5"},{"$f":"Results!AW79","v":"Dans quelle mesure les différentes sources de revenus sont-elles collectées de façon progressive (c.-à-d. en fonction de la capacité de payer), et partant de là favorisent l’équité dans le mode de financement du système de santé ?"},{"$f":"Results!AX79","v":""},{"$f":"Results!AY79","v":0}]
[{"$f":"Results!$B$2","v":0},"",{"$error":"#N/A"},{"$error":"#N/A"},{"$f":"Results!$B$6","v":0},null,{"$f":"CONCATENATE(Results!$C$4,\" - \",Results!$B$4)","v":"0 - 0"},{"$f":"CONCATENATE(Results!$C$5,\" - \",Results!$B$5)","v":"0 - 0"},{"$f":"Results!AZ80","v":false},{"$f":"Results!AU80","v":"Equity_finance "},{"$f":"Results!AV80","v":"Q3.4"},{"$f":"Results!AW80","v":"Y-a-il des mesures, dans la conception des prestations, le paiement des prestataires ou les systèmes sous-jacents non financiers, qui visent à contrecarrer les problèmes découlant de la fragmentation de l’architecture du financement de la santé ?"},{"$f":"Results!AX80","v":""},{"$f":"Results!AY80","v":0}]
[{"$f":"Results!$B$2","v":0},"",{"$error":"#N/A"},{"$error":"#N/A"},{"$f":"Results!$B$6","v":0},null,{"$f":"CONCATENATE(Results!$C$4,\" - \",Results!$B$4)","v":"0 - 0"},{"$f":"CONCATENATE(Results!$C$5,\" - \",Results!$B$5)","v":"0 - 0"},{"$f":"Results!AZ81","v":false},{"$f":"Results!AU81","v":"Equity_finance "},{"$f":"Results!AV81","v":"Q3.6"},{"$f":"Results!AW81","v":"Dans quelle mesure les dispositifs d’assurance-maladie volontaire sont-ils une source d’inégalités, créant des effets de contagion potentiellement néfastes pour l’ensemble du système de santé ?"},{"$f":"Results!AX81","v":""},{"$f":"Results!AY81","v":0}]
[{"$f":"Results!$B$2","v":0},"",{"$error":"#N/A"},{"$error":"#N/A"},{"$f":"Results!$B$6","v":0},null,{"$f":"CONCATENATE(Results!$C$4,\" - \",Results!$B$4)","v":"0 - 0"},{"$f":"CONCATENATE(Results!$C$5,\" - \",Results!$B$5)","v":"0 - 0"},{"$f":"Results!AZ82","v":false},{"$f":"Results!AU82","v":"Equity_finance "},{"$f":"Results!AV82","v":"Q4.10"},{"$f":"Results!AW82","v":"Dans quelle mesure l’achat et le paiement des produits pharmaceutiques sont-ils mis en œuvre pour promouvoir l’utilisation efficace des médicaments (par exemple le recours aux génériques plutôt qu’aux princeps) et pour améliorer la protection financière des patients ?"},{"$f":"Results!AX82","v":""},{"$f":"Results!AY82","v":0}]
[{"$f":"Results!$B$2","v":0},"",{"$error":"#N/A"},{"$error":"#N/A"},{"$f":"Results!$B$6","v":0},null,{"$f":"CONCATENATE(Results!$C$4,\" - \",Results!$B$4)","v":"0 - 0"},{"$f":"CONCATENATE(Results!$C$5,\" - \",Results!$B$5)","v":"0 - 0"},{"$f":"Results!AZ83","v":false},{"$f":"Results!AU83","v":"Equity_finance "},{"$f":"Results!AV83","v":"Q5.4"},{"$f":"Results!AW83","v":"Dans quelle mesure les prestations accordent-elles la priorité aux catégories de population prioritaires, par exemple pour une meilleure utilisation des services hautement prioritaires et pour la protection financière ?"},{"$f":"Results!AX83","v":""},{"$f":"Results!AY83","v":0}]
[{"$f":"Results!$B$2","v":0},"",{"$error":"#N/A"},{"$error":"#N/A"},{"$f":"Results!$B$6","v":0},null,{"$f":"CONCATENATE(Results!$C$4,\" - \",Results!$B$4)","v":"0 - 0"},{"$f":"CONCATENATE(Results!$C$5,\" - \",Results!$B$5)","v":"0 - 0"},{"$f":"Results!AZ84","v":false},{"$f":"Results!AU84","v":"Equity_finance "},{"$f":"Results!AV84","v":"Q5.6"},{"$f":"Results!AW84","v":"Dans quelle mesure les prestations sont-elles alignées sur le paiement des prestataires, afin de s’assurer qu’elles sont fournies et que les patients bénéficient d’une protection financière ?"},{"$f":"Results!AX84","v":""},{"$f":"Results!AY84","v":0}]
[{"$f":"Results!$B$2","v":0},"",{"$error":"#N/A"},{"$error":"#N/A"},{"$f":"Results!$B$6","v":0},null,{"$f":"CONCATENATE(Results!$C$4,\" - \",Results!$B$4)","v":"0 - 0"},{"$f":"CONCATENATE(Results!$C$5,\" - \",Results!$B$5)","v":"0 - 0"},{"$f":"Results!AZ85","v":false},{"$f":"Results!AU85","v":"Quality"},{"$f":"Results!AV85","v":"Q4.2"},{"$f":"Results!AW85","v":"Dans quelle mesure les paiements des prestataires sont-ils harmonisés entre régimes/sources de revenus et entre secteurs public et privé, afin de garantir des incitations cohérentes aux prestataires ?"},{"$f":"Results!AX85","v":""},{"$f":"Results!AY85","v":0}]
[{"$f":"Results!$B$2","v":0},"",{"$error":"#N/A"},{"$error":"#N/A"},{"$f":"Results!$B$6","v":0},null,{"$f":"CONCATENATE(Results!$C$4,\" - \",Results!$B$4)","v":"0 - 0"},{"$f":"CONCATENATE(Results!$C$5,\" - \",Results!$B$5)","v":"0 - 0"},{"$f":"Results!AZ86","v":false},{"$f":"Results!AU86","v":"Quality"},{"$f":"Results!AV86","v":"Q4.3"},{"$f":"Results!AW86","v":"Dans quelle mesure les méthodes de paiement des prestataires et les achats en général favorisent-ils la qualité des soins et la coordination des soins entre les spécialités et les différents niveaux de soins ?"},{"$f":"Results!AX86","v":""},{"$f":"Results!AY86","v":0}]
[{"$f":"Results!$B$2","v":0},"",{"$error":"#N/A"},{"$error":"#N/A"},{"$f":"Results!$B$6","v":0},null,{"$f":"CONCATENATE(Results!$C$4,\" - \",Results!$B$4)","v":"0 - 0"},{"$f":"CONCATENATE(Results!$C$5,\" - \",Results!$B$5)","v":"0 - 0"},{"$f":"Results!AZ87","v":false},{"$f":"Results!AU87","v":"Quality"},{"$f":"Results!AV87","v":"Q4.4"},{"$f":"Results!AW87","v":"Dans quelle mesure les contrats d’achat précisent-ils des exigences en matière de qualité des soins, y compris la disponibilité et la pertinence des soins, puis vérifient-ils de façon régulière qu’elles sont bien respectées ?"},{"$f":"Results!AX87","v":""},{"$f":"Results!AY87","v":0}]
[{"$f":"Results!$B$2","v":0},"",{"$error":"#N/A"},{"$error":"#N/A"},{"$f":"Results!$B$6","v":0},null,{"$f":"CONCATENATE(Results!$C$4,\" - \",Results!$B$4)","v":"0 - 0"},{"$f":"CONCATENATE(Results!$C$5,\" - \",Results!$B$5)","v":"0 - 0"},{"$f":"Results!AZ88","v":false},{"$f":"Results!AU88","v":"Quality"},{"$f":"Results!AV88","v":"Q4.6"},{"$f":"Results!AW88","v":"Dans quelle mesure les formulaires de consultation des patients sont-ils normalisés dans l'ensemble du système de santé et utilisés pour analyser et évaluer l'activité de l’ensemble des prestataires et de la population "},{"$f":"Results!AX88","v":""},{"$f":"Results!AY88","v":0}]
[{"$f":"Results!$B$2","v":0},"",{"$error":"#N/A"},{"$error":"#N/A"},{"$f":"Results!$B$6","v":0},null,{"$f":"CONCATENATE(Results!$C$4,\" - \",Results!$B$4)","v":"0 - 0"},{"$f":"CONCATENATE(Results!$C$5,\" - \",Results!$B$5)","v":"0 - 0"},{"$f":"Results!AZ89","v":false},{"$f":"Results!AU89","v":"Quality"},{"$f":"Results!AV89","v":"Q4.7"},{"$f":"Results!AW89","v":"Dans quelle mesure les paiements des prestataires  couvrent  uniquement une partie ou l’ensemble des coûts totaux (y compris les salaires, les dépenses récurrentes, etc.) ?"},{"$f":"Results!AX89","v":""},{"$f":"Results!AY89","v":0}]
[{"$f":"Results!$B$2","v":0},"",{"$error":"#N/A"},{"$error":"#N/A"},{"$f":"Results!$B$6","v":0},null,{"$f":"CONCATENATE(Results!$C$4,\" - \",Results!$B$4)","v":"0 - 0"},{"$f":"CONCATENATE(Results!$C$5,\" - \",Results!$B$5)","v":"0 - 0"},{"$f":"Results!AZ90","v":false},{"$f":"Results!AU90","v":"Quality"},{"$f":"Results!AV90","v":"Q4.8"},{"$f":"Results!AW90","v":"Dans quelle mesure les prestataires jouissent-ils d’une autonomie financière et sont-ils tenus responsables, dans une mesure réaliste et conforme à leurs capacités ?"},{"$f":"Results!AX90","v":""},{"$f":"Results!AY90","v":0}]
[{"$f":"Results!$B$2","v":0},"",{"$error":"#N/A"},{"$error":"#N/A"},{"$f":"Results!$B$6","v":0},null,{"$f":"CONCATENATE(Results!$C$4,\" - \",Results!$B$4)","v":"0 - 0"},{"$f":"CONCATENATE(Results!$C$5,\" - \",Results!$B$5)","v":"0 - 0"},{"$f":"Results!AZ91","v":false},{"$f":"Results!AU91","v":"Quality"},{"$f":"Results!AV91","v":"Q4.9"},{"$f":"Results!AW91","v":"Dans quelle mesure l’accréditation des prestataires ou les contrats sélectifs sont-ils établis, fonctionnels et utilisés pour les achats ?"},{"$f":"Results!AX91","v":""},{"$f":"Results!AY91","v":0}]
[{"$f":"Results!$B$2","v":0},"",{"$error":"#N/A"},{"$error":"#N/A"},{"$f":"Results!$B$6","v":0},null,{"$f":"CONCATENATE(Results!$C$4,\" - \",Results!$B$4)","v":"0 - 0"},{"$f":"CONCATENATE(Results!$C$5,\" - \",Results!$B$5)","v":"0 - 0"},{"$f":"Results!AZ92","v":false},{"$f":"Results!AU92","v":"Quality"},{"$f":"Results!AV92","v":"Q7.2"},{"$f":"Results!AW92","v":"Dans quelle mesure les institutions responsables du financement de la santé disposent-elles de capacités adéquates, notamment en matière de ressources humaines (capacités techniques et managériales) et de TIC ?"},{"$f":"Results!AX92","v":""},{"$f":"Results!AY92","v":0}]

{"sheet":"Policy Development Process","index":14,"n_rows":81,"n_cols":23,"rows_kept":81,"cut":false,"hidden":true,"merged":[[39,3,52,4],[39,6,42,21],[81,3,84,22],[7,3,20,4],[23,3,36,4],[23,6,26,21],[75,3,78,22],[7,6,10,21],[56,3,69,4],[56,6,59,21],[47,6,49,8],[46,17,50,19],[19,22,20,23],[35,22,36,23],[51,22,52,23],[68,22,69,23]]}
[]
[]
[]
[]
[null,null,null,"1. Processus d’élaboration des politiques",null,null,null,null,null,null,null," "]
[]
[null,null,null,null,null,null,"Quelle est la situation actuelle dans votre pays en ce qui concerne Q1.1?"]
[null,null,null,"Q1.1 Le système de financement de la santé de votre pays a-t-il récemment fait l’objet d’un diagnostic ou d’une évaluation approfondie qui examine son impact sur les performances du système de santé ainsi que les causes des problèmes de performance ?\n\n",null,null,"Veuillez indiquer dans cette zone de texte vos idées, réflexions, évolutions récentes, projets actuels, etc."]
[]
[]
[]
[]
[]
[]
[]
[]
[]
[]
[]
[null,null,null,null,null,null,null,null,null,null,null,null,null,null,null,null,null,null,null,null,null,null,{"$f":"Results!H8","v":"0/12"}]
[]
[]
[null,null,null,null,null,null,"Quelle est la situation actuelle dans votre pays en ce qui concerne Q1.2?"]
[null,null,null,"Q1.2 A-t-on transposé en textes de loi/décrets une déclaration de politique récente relative au financement de la santé ?",null,null,"Veuillez indiquer dans cette zone de texte vos idées, réflexions, évolutions récentes, projets actuels, etc."]
[]
[]
[]
[]
[]
[]
[]
[]
[]
[]
[]
[null,null,null,null,null,null,null,null,null,null,null,null,null,null,null,null,null,null,null,null,null,null,{"$f":"Results!H9","v":"0/12"}]
[]
[]
[null,null,null,null,null,null,"Quelle est la situation actuelle dans votre pays en ce qui concerne Q1.3?"]
[null,null,null,"Q1.3 Existe-t-il un système de suivi régulier du financement de la santé, et si oui les données sont-elles utilisées pour suivre les progrès effectués (par exemple sur les modèles de dépenses et la protection financière) et pour renforcer la reddition de comptes ?\n",null,null,"Veuillez indiquer dans cette zone de texte vos idées, réflexions, évolutions récentes, projets actuels, etc."]
[]
[]
[]
[]
[]
[]
[]
[]
[]
[]
[]
[null,null,null,null,null,null,null,null,null,null,null,null,null,null,null,null,null,null,null,null,null,null,{"$f":"Results!H10","v":"0/12"}]
[]
[]
[]
[null,null,null,null,null,null,"Quelle est la situation actuelle dans votre pays en ce qui concerne Q1.4?"]
[null,null,null,"Q1.4 Les études d’évaluation sont-elles réalisées sur une base systématique pour mesurer les conséquences de la mise en œuvre de réformes spécifiques du financement sur les objectifs du système de santé et dans quelles mesure les résultats servent-ils à guider la conception et la révision des politiques de financement de la santé ?\n",null,null,"Veuillez indiquer dans cette zone de texte vos idées, réflexions, évolutions récentes, projets actuels, etc."]
[]
[]
[]
[]
[]
[]
[]
[]
[]
[]
[]
[null,null,null,null,null,null,null,null,null,null,null,null,null,null,null,null,null,null,null,null,null,null,{"$f":"Results!H11","v":"0/12"}]
[]
[]
[]
[]
[]
[null,null,null,"Résumez ici les prochaines étapes, priorités ou points d’action que vous avez identifiés après avoir complété cette matrice relative aux Prestations et droits."]
[]
[]
[]
[]
[]
[null,null,null,"Commentaires (retour d’informations sur la conception, la pertinence et la clarté des questions) dans cette matrice relative aux Prestations et droits."]

{"sheet":"Revenue Raising","index":15,"n_rows":95,"n_cols":23,"rows_kept":95,"cut":false,"hidden":true,"merged":[[19,22,20,23],[35,22,36,23],[51,22,52,23],[67,22,68,23],[83,22,84,23],[89,3,92,22],[95,3,98,22],[55,3,68,4],[55,6,58,21],[71,3,84,4],[71,6,74,21],[62,6,66,8],[62,10,66,12],[62,14,66,15],[62,17,66,19],[78,10,82,12],[78,14,82,16],[7,3,20,4],[7,6,10,21],[23,3,36,4],[23,6,26,21],[39,3,52,4],[39,6,42,21],[14,6,18,8],[14,10,18,12],[14,17,18,19],[14,14,18,15],[30,17,34,19],[46,6,50,8],[46,10,50,12],[46,14,50,15],[46,17,50,19]]}
[]
[]
[]
[]
[null,null,null,"2. Collecte de recettes",null,null,null,null,null,null,null," "]
[]
[null,null,null,null,null,null,"Quelle est la situation actuelle dans votre pays en ce qui concerne Q2.1?"]
[null,null,null,"Q2.1 Quelle approche est en vigueur dans votre pays en matière d’élaboration de politiques et de stratégies de collecte de revenus ? Cette approche s'inscrit-elle dans le cadre du processus global d’élaboration et de planification de la mise en œuvre des politiques de financement de la santé ?\n",null,null,"Veuillez indiquer dans cette zone de texte vos idées, réflexions, évolutions récentes, projets actuels, etc.",null,null,null,null,null,null,null,null,null,null,null,null,null,null,null,1]
[]
[]
[]
[]
[]
[]
[]
[]
[]
[]
[]
[null,null,null,null,null,null,null,null,null,null,null,null,null,null,null,null,null,null,null,null,null,null,{"$f":"Results!H12","v":"0/12"}]
[]
[]
[null,null,null,null,null,null,"Quelle est la situation actuelle dans votre pays en ce qui concerne Q2.2?"]
[null,null,null,"Q2.2 Dans quelle mesure le financement de la santé dans votre pays repose-t-il sur des sources de financement public/obligatoire (par exemple, fiscalité/recettes publiques, y compris les cotisations obligatoires à l’assurance-maladie nationale/sociale) ?\n",null,null,"Veuillez indiquer dans cette zone de texte vos idées, réflexions, évolutions récentes, projets actuels, etc.",null,null,null,null,null,null,null,null,null,null,null,null,null,null,null,1]
[]
[]
[]
[]
[]
[]
[]
[]
[]
[]
[]
[null,null,null,null,null,null,null,null,null,null,null,null,null,null,null,null,null,null,null,null,null,null,{"$f":"Results!H13","v":"0/12"}]
[]
[]
[null,null,null,null,null,null,"Quelle est la situation actuelle dans votre pays en ce qui concerne Q2.3?"]
[null,null,null,"Q2.3 Dans quelle mesure le financement public de la santé dans votre pays est-il prédictible sur plusieurs années ?\n",null,null,"Veuillez indiquer dans cette zone de texte vos idées, réflexions, évolutions récentes, projets actuels, etc.",null,null,null,null,null,null,null,null,null,null,null,null,null,null,null,1]
[]
[]
[]
[]
[]
[]
[]
[]
[]
[]
[]
[null,null,null,null,null,null,null,null,null,null,null,null,null,null,null,null,null,null,null,null,null,null,{"$f":"Results!H14","v":"0/12"}]
[]
[]
[null,null,null,null,null,null,"Quelle est la situation actuelle dans votre pays en ce qui concerne Q2.4?"]
[null,null,null,"Q2.4 Dans quelle mesure le flux de fonds publics est-il stable, notamment grâce à une exécution budgétaire régulière, c’est-à-dire un déblocage des fonds dans les délais, conformément aux budgets de santé approuvés ?\n",null,null,"Veuillez indiquer dans cette zone de texte vos idées, réflexions, évolutions récentes, projets actuels, etc.",null,null,null,null,null,null,null,null,null,null,null,null,null,null,null,1]
[]
[]
[]
[]
[]
[]
[]
[]
[]
[]
[]
[null,null,null,null,null,null,null,null,null,null,null,null,null,null,null,null,null,null,null,null,null,null,{"$f":"Results!H15","v":"0/12"}]
[]
[]
[null,null,null,null,null,null,"Quelle est la situation actuelle dans votre pays en ce qui concerne Q2.5?"]
[null,null,null,"Q2.5 Dans quelle mesure les différentes sources de revenus sont-elles collectées de façon progressive (c.-à-d. en fonction de la capacité de payer), et partant de là favorisent l’équité dans le mode de financement du système de santé ?\n",null,null,"Veuillez indiquer dans cette zone de texte vos idées, réflexions, évolutions récentes, projets actuels, etc.",null,null,null,null,null,null,null,null,null,null,null,null,null,null,null,1]
[]
[]
[]
[]
[]
[]
[]
[]
[]
[]
[]
[null,null,null,null,null,null,null,null,null,null,null,null,null,null,null,null,null,null,null,null,null,null,{"$f":"Results!H16","v":"0/12"}]
[]
[]
[]
[]
[null,null,null,"Résumez ici les prochaines étapes, priorités ou points d’action que vous avez identifiés après avoir complété cette matrice relative aux Prestations et droits."]
[]
[]
[]
[]
[]
[null,null,null,"Commentaires (retour d’informations sur la conception, la pertinence et la clarté des questions) dans cette matrice relative aux Prestations et droits."]

{"sheet":"Pooling Revenues","index":16,"n_rows":127,"n_cols":23,"rows_kept":127,"cut":false,"hidden":true,"merged":[[35,22,36,23],[51,22,52,23],[67,22,68,23],[83,22,84,23],[99,22,100,23],[78,17,82,19],[94,6,98,8],[94,10,98,12],[94,14,98,15],[94,17,98,19],[121,3,124,22],[127,3,130,22],[87,3,100,4],[87,6,90,21],[103,3,116,4],[103,6,106,21],[110,6,114,8],[110,10,114,12],[110,14,114,15],[110,17,114,19],[115,22,116,23],[55,3,68,4],[55,6,58,21],[71,3,84,4],[71,6,74,21],[39,3,52,4],[46,6,50,8],[46,10,50,12],[46,14,50,15],[46,17,50,19],[62,6,66,8],[62,10,66,12],[62,14,66,15],[62,17,66,19],[78,6,82,8],[78,10,82,12],[78,14,82,15],[7,3,20,4],[7,6,20,21],[39,6,42,21],[23,3,36,4],[23,6,26,21],[30,6,34,8],[30,10,34,12],[30,14,34,15],[30,17,34,19]]}
[]
[]
[]
[]
[null,null,null,"3. Mise en commun des recettes",null,null,null,null,null,null,null," "]
[]
[]
[null,null,null,"Q3.1 Cette question a été maintenant remplacé par l’étape 1 et le tableau de vue d’ensemble et ne constitue donc plus une question distincte. Merci de bien vous assurer que vous avez complété l’étape 1 car cela vous aidera à remplir les questions de cette section.\n"]
[]
[]
[]
[]
[]
[]
[]
[]
[]
[]
[]
[]
[]
[]
[null,null,null,null,null,null,"Quelle est la situation actuelle dans votre pays en ce qui concerne Q3.2?"]
[null,null,null,"Q3.2 Dans le cadre du processus global d’élaboration et de planification de la mise en œuvre des politiques de financement de la santé, quelle est l’approche de votre pays en matière de dispositifs de mise en commun des ressources ?",null,null,"Veuillez indiquer dans cette zone de texte vos idées, réflexions, évolutions récentes, projets actuels, etc.",null,null,null,null,null,null,null,null,null,null,null,null,null,null,null,1]
[]
[]
[]
[]
[]
[]
[]
[]
[]
[]
[]
[null,null,null,null,null,null,null,null,null,null,null,null,null,null,null,null,null,null,null,null,null,null,{"$f":"Results!H18","v":"0/12"}]
[]
[]
[null,null,null,null,null,null,"Quelle est la situation actuelle dans votre pays en ce qui concerne Q3.3?"]
[null,null,null,"Q3.3 Dans quelle mesure la capacité de redistribution des fonds prépayés dans votre pays est-elle limitée par le cadre institutionnel du financement de la santé ?",null,null,"Veuillez indiquer dans cette zone de texte vos idées, réflexions, évolutions récentes, projets actuels, etc.",null,null,null,null,null,null,null,null,null,null,null,null,null,null,null,1]
[]
[]
[]
[]
[]
[]
[]
[]
[]
[]
[]
[null,null,null,null,null,null,null,null,null,null,null,null,null,null,null,null,null,null,null,null,null,null,{"$f":"Results!H19","v":"0/12"}]
[]
[]
[null,null,null,null,null,null,"Quelle est la situation actuelle dans votre pays en ce qui concerne Q3.4?"]
[null,null,null,"Q3.4  Y-a-il des mesures, dans la conception des prestations, le paiement des prestataires ou les systèmes sous-jacents non financiers, qui visent à contrecarrer les problèmes découlant de la fragmentation de l’architecture du financement de la santé ?\n",null,null,"Veuillez indiquer dans cette zone de texte vos idées, réflexions, évolutions récentes, projets actuels, etc.",null,null,null,null,null,null,null,null,null,null,null,null,null,null,null,1]
[]
[]
[]
[]
[]
[]
[]
[]
[]
[]
[]
[null,null,null,null,null,null,null,null,null,null,null,null,null,null,null,null,null,null,null,null,null,null,{"$f":"Results!H20","v":"0/12"}]
[]
[]
[null,null,null,null,null,null,"Quelle est la situation actuelle dans votre pays en ce qui concerne Q3.5?"]
[null,null,null,"Q3.5 Dans quelle mesure les différentes sources de recettes et de financement sont-elles organisées de manière complémentaire, afin de financer un paquet de prestations pour l’ensemble de la population ?\n",null,null,"Veuillez indiquer dans cette zone de texte vos idées, réflexions, évolutions récentes, projets actuels, etc.",null,null,null,null,null,null,null,null,null,null,null,null,null,null,null,1]
[]
[]
[]
[]
[]
[]
[]
[]
[]
[]
[]
[null,null,null,null,null,null,null,null,null,null,null,null,null,null,null,null,null,null,null,null,null,null,{"$f":"Results!H21","v":"0/12"}]
[]
[]
[null,null,null,null,null,null,"Quelle est la situation actuelle dans votre pays en ce qui concerne Q3.6?"]
[null,null,null,"Q3.6 Dans quelle mesure les dispositifs d’assurance-maladie volontaire sont-ils une source d’inégalités, créant des effets de contagion potentiellement néfastes pour l’ensemble du système de santé ?\n",null,null,"Veuillez indiquer dans cette zone de texte vos idées, réflexions, évolutions récentes, projets actuels, etc.",null,null,null,null,null,null,null,null,null,null,null,null,null,null,null,1]
[]
[]
[]
[]
[]
[]
[]
[]
[]
[]
[]
[null,null,null,null,null,null,null,null,null,null,null,null,null,null,null,null,null,null,null,null,null,null,{"$f":"Results!H22","v":"0/12"}]
[]
[]
[null,null,null,null,null,null,"Quelle est la situation actuelle dans votre pays en ce qui concerne Q3.7?"]
[null,null,null,"Q3.7 Dans quelle mesure les flux financiers sont-ils incohérents et redondants, et empêchent d’utiliser efficacement le budget public et les fonds des donateurs ?",null,null,"Veuillez indiquer dans cette zone de texte vos idées, réflexions, évolutions récentes, projets actuels, etc.",null,null,null,null,null,null,null,null,null,null,null,null,null,null,null,1]
[]
[]
[]
[]
[]
[]
[]
[]
[]
[]
[]
[null,null,null,null,null,null,null,null,null,null,null,null,null,null,null,null,null,null,null,null,null,null,{"$f":"Results!H23","v":"0/12"}]
[]
[]
[]
[]
[null,null,null,"Résumez ici les prochaines étapes, priorités ou points d’action que vous avez identifiés après avoir complété cette matrice relative aux Prestations et droits."]
[]
[]
[]
[]
[]
[null,null,null,"Commentaires (retour d’informations sur la conception, la pertinence et la clarté des questions) dans cette matrice relative aux Prestations et droits."]

{"sheet":"Purchasing and Provider Payment","index":17,"n_rows":175,"n_cols":23,"rows_kept":175,"cut":false,"hidden":true,"merged":[[99,22,100,23],[115,22,116,23],[131,22,132,23],[147,22,148,23],[163,22,164,23],[19,22,20,23],[35,22,36,23],[51,22,52,23],[67,22,68,23],[83,22,84,23],[62,17,66,19],[78,17,82,19],[158,12,162,19],[103,3,116,4],[103,6,106,21],[119,3,132,4],[119,6,122,21],[135,3,148,4],[135,6,138,21],[95,6,98,8],[95,10,98,12],[95,14,98,16],[95,18,98,20],[169,3,172,22],[175,3,178,22],[7,3,20,4],[7,6,10,21],[23,3,36,4],[23,6,26,21],[39,3,52,4],[39,6,42,21],[55,3,68,4],[55,6,58,21],[71,3,84,4],[71,6,74,21],[87,3,100,4],[87,6,90,21],[151,3,164,4],[151,6,154,21]]}
[]
[]
[]
[]
[null,null,null,"4. Achats et paiement des prestataires",null,null,null,null,null,null,null," "]
[]
[null,null,null,null,null,null,"Quelle est la situation actuelle dans votre pays en ce qui concerne Q4.1?"]
[null,null,null,"Q4.1 Dans quelle mesure les allocations de fonds aux acheteurs de niveau inférieur, par exemple les administrations locales, et/ou les taux de paiement aux prestataires sont-ils le reflet des besoins de santé de la population ?\n",null,null,"Veuillez indiquer dans cette zone de texte vos idées, réflexions, évolutions récentes, projets actuels, etc.",null,null,null,null,null,null,null,null,null,null,null,null,null,null,null,1]
[]
[]
[]
[]
[]
[]
[]
[]
[]
[]
[]
[null,null,null,null,null,null,null,null,null,null,null,null,null,null,null,null,null,null,null,null,null,null,{"$f":"Results!H24","v":"0/12"}]
[]
[]
[null,null,null,null,null,null,"Quelle est la situation actuelle dans votre pays en ce qui concerne Q4.2?"]
[null,null,null,"Q4.2 Dans quelle mesure les paiements des prestataires sont-ils harmonisés entre régimes/sources de revenus et entre secteurs public et privé, afin de garantir des incitations cohérentes aux prestataires ?\n",null,null,"Veuillez indiquer dans cette zone de texte vos idées, réflexions, évolutions récentes, projets actuels, etc.",null,null,null,null,null,null,null,null,null,null,null,null,null,null,null,1]
[]
[]
[]
[]
[]
[]
[]
[]
[]
[]
[]
[null,null,null,null,null,null,null,null,null,null,null,null,null,null,null,null,null,null,null,null,null,null,{"$f":"Results!H25","v":"0/12"}]
[]
[]
[null,null,null,null,null,null,"Quelle est la situation actuelle dans votre pays en ce qui concerne Q4.3?"]
[null,null,null,"Q4.3 Dans quelle mesure les méthodes de paiement des prestataires et les achats en général favorisent-ils la qualité des soins et la coordination des soins entre les spécialités et les différents niveaux de soins ?\n",null,null,"Veuillez indiquer dans cette zone de texte vos idées, réflexions, évolutions récentes, projets actuels, etc.",null,null,null,null,null,null,null,null,null,null,null,null,null,null,null,1]
[]
[]
[]
[]
[]
[]
[]
[]
[]
[]
[]
[null,null,null,null,null,null,null,null,null,null,null,null,null,null,null,null,null,null,null,null,null,null,{"$f":"Results!H26","v":"0/12"}]
[]
[]
[null,null,null,null,null,null,"Quelle est la situation actuelle dans votre pays en ce qui concerne Q4.4?"]
[null,null,null,"Q4.4 Dans quelle mesure les contrats d’achat précisent-ils des exigences en matière de qualité des soins, y compris la disponibilité et la pertinence des soins, puis vérifient-ils de façon régulière qu’elles sont bien respectées ?\n",null,null,"Veuillez indiquer dans cette zone de texte vos idées, réflexions, évolutions récentes, projets actuels, etc.",null,null,null,null,null,null,null,null,null,null,null,null,null,null,null,1]
[]
[]
[]
[]
[]
[]
[]
[]
[]
[]
[]
[null,null,null,null,null,null,null,null,null,null,null,null,null,null,null,null,null,null,null,null,null,null,{"$f":"Results!H27","v":"0/12"}]
[]
[]
[null,null,null,null,null,null,"Quelle est la situation actuelle dans votre pays en ce qui concerne Q4.5?"]
[null,null,null,"Q4.5 Dans quelle mesure les méthodes de paiement des prestataires favorisent-elles l’efficacité de l’allocation des ressources, par exemple en réduisant la prestation excessive ou en augmentant celle insuffisante des services, et gèrent-elles la croissance des dépenses ?\n",null,null,"Veuillez indiquer dans cette zone de texte vos idées, réflexions, évolutions récentes, projets actuels, etc.",null,null,null,null,null,null,null,null,null,null,null,null,null,null,null,1]
[]
[]
[]
[]
[]
[]
[]
[]
[]
[]
[]
[null,null,null,null,null,null,null,null,null,null,null,null,null,null,null,null,null,null,null,null,null,null,{"$f":"Results!H28","v":"0/12"}]
[]
[]
[null,null,null,null,null,null,"Quelle est la situation actuelle dans votre pays en ce qui concerne Q4.6?"]
[null,null,null,"Q4.6 Dans quelle mesure les formulaires de consultation des patients sont-ils normalisés dans l'ensemble du système de santé et utilisés pour analyser et évaluer l'activité de l’ensemble des prestataires et de la population \n",null,null,"Veuillez indiquer dans cette zone de texte vos idées, réflexions, évolutions récentes, projets actuels, etc.",null,null,null,null,null,null,null,null,null,null,null,null,null,null,null,1]
[]
[]
[]
[]
[]
[]
[]
[]
[]
[]
[]
[null,null,null,null,null,null,null,null,null,null,null,null,null,null,null,null,null,null,null,null,null,null,{"$f":"Results!H29","v":"0/12"}]
[]
[]
[null,null,null,null,null,null,"Quelle est la situation actuelle dans votre pays en ce qui concerne Q4.7?"]
[null,null,null,"Q4.7 Dans quelle mesure les paiements des prestataires  couvrent  uniquement une partie ou l’ensemble des coûts totaux (y compris les salaires, les dépenses récurrentes, etc.) ?\n\n\n",null,null,"Veuillez indiquer dans cette zone de texte vos idées, réflexions, évolutions récentes, projets actuels, etc.",null,null,null,null,null,null,null,null,null,null,null,null,null,null,null,1]
[]
[]
[]
[]
[]
[]
[]
[]
[]
[]
[]
[null,null,null,null,null,null,null,null,null,null,null,null,null,null,null,null,null,null,null,null,null,null,{"$f":"Results!H30","v":"0/12"}]
[]
[]
[null,null,null,null,null,null,"Quelle est la situation actuelle dans votre pays en ce qui concerne Q4.8?"]
[null,null,null,"Q4.8 Dans quelle mesure les prestataires jouissent-ils d’une autonomie financière et sont-ils tenus responsables, dans une mesure réaliste et conforme à leurs capacités ?\n",null,null,"Veuillez indiquer dans cette zone de texte vos idées, réflexions, évolutions récentes, projets actuels, etc.",null,null,null,null,null,null,null,null,null,null,null,null,null,null,null,1]
[]
[]
[]
[]
[]
[]
[]
[]
[]
[]
[]
[null,null,null,null,null,null,null,null,null,null,null,null,null,null,null,null,null,null,null,null,null,null,{"$f":"Results!H31","v":"0/12"}]
[]
[]
[null,null,null,null,null,null,"Quelle est la situation actuelle dans votre pays en ce qui concerne Q4.9?"]
[null,null,null,"Q4.9 Dans quelle mesure l’accréditation des prestataires ou les contrats sélectifs sont-ils établis, fonctionnels et utilisés pour les achats ?\n",null,null,"Veuillez indiquer dans cette zone de texte vos idées, réflexions, évolutions récentes, projets actuels, etc.",null,null,null,null,null,null,null,null,null,null,null,null,null,null,null,1]
[]
[]
[]
[]
[]
[]
[]
[]
[]
[]
[]
[null,null,null,null,null,null,null,null,null,null,null,null,null,null,null,null,null,null,null,null,null,null,{"$f":"Results!H32","v":"0/12"}]
[]
[]
[null,null,null,null,null,null,"Quelle est la situation actuelle dans votre pays en ce qui concerne Q4.10?"]
[null,null,null,"Q4.10 Dans quelle mesure l’achat et le paiement des produits pharmaceutiques sont-ils mis en œuvre pour promouvoir l’utilisation efficace des médicaments (par exemple le recours aux génériques plutôt qu’aux princeps) et pour améliorer la protection financière des patients ?\n",null,null,"Veuillez indiquer dans cette zone de texte vos idées, réflexions, évolutions récentes, projets actuels, etc.",null,null,null,null,null,null,null,null,null,null,null,null,null,null,null,1]
[]
[]
[]
[]
[]
[]
[]
[]
[]
[]
[]
[null,null,null,null,null,null,null,null,null,null,null,null,null,null,null,null,null,null,null,null,null,null,{"$f":"Results!H33","v":"0/12"}]
[]
[]
[]
[]
[null,null,null,"Résumez ici les prochaines étapes, priorités ou points d’action que vous avez identifiés après avoir complété cette matrice relative aux Prestations et droits."]
[]
[]
[]
[]
[]
[null,null,null,"Commentaires (retour d’informations sur la conception, la pertinence et la clarté des questions) dans cette matrice relative aux Prestations et droits."]

{"sheet":"Benefits and Entitlements","index":18,"n_rows":127,"n_cols":23,"rows_kept":127,"cut":false,"hidden":true,"merged":[[115,22,116,23],[51,22,52,23],[67,22,68,23],[35,22,36,23],[83,22,84,23],[99,22,100,23],[121,3,124,22],[127,3,130,22],[103,6,106,21],[7,6,20,21],[55,3,68,4],[55,6,58,21],[71,3,84,4],[71,6,74,21],[87,3,100,4],[87,6,90,21],[103,3,116,4],[7,3,20,4],[23,3,36,4],[23,6,26,21],[39,3,52,4],[39,6,42,21]]}
[]
[]
[]
[]
[null,null,null,"5. Prestations et droits",null,null,null,null,null,null,null," "," "]
[]
[]
[null,null,null,"Q5.1 Cette question a été maintenant remplacé par l’étape 1 et le tableau de vue d’ensemble et ne constitue donc plus une question distincte. Merci de bien vous assurer que vous avez complété l’étape 1 car cela vous aidera à remplir les questions de cette section."]
[]
[]
[]
[]
[]
[]
[]
[]
[]
[]
[]
[]
[]
[]
[null,null,null,null,null,null,"Quelle est la situation actuelle dans votre pays en ce qui concerne Q5.2?"]
[null,null,null,"Q5.2 Dans quelle mesure les décisions et les révisions relatives aux prestations sont-elles prises de manière transparente, sur la base d’un processus clairement défini et de critères convenus, tels que le rapport coût-efficacité, la protection financière, l’impact budgétaire ?\n",null,null,"Veuillez indiquer dans cette zone de texte vos idées, réflexions, évolutions récentes, projets actuels, etc.",null,null,null,null,null,null,null,null,null,null,null,null,null,null,null,1]
[]
[]
[]
[]
[]
[]
[]
[]
[]
[]
[]
[null,null,null,null,null,null,null,null,null,null,null,null,null,null,null,null,null,null,null,null,null,null,{"$f":"Results!H35","v":"0/12"}]
[]
[]
[null,null,null,null,null,null,"Quelle est la situation actuelle dans votre pays en ce qui concerne Q5.3?"]
[null,null,null,"Q5.3 Dans quelle mesure les droits à prestation reflètent-ils explicitement les besoins de santé de la population ?\n",null,null,"Veuillez indiquer dans cette zone de texte vos idées, réflexions, évolutions récentes, projets actuels, etc.",null,null,null,null,null,null,null,null,null,null,null,null,null,null,null,0]
[]
[]
[]
[]
[]
[]
[]
[]
[]
[]
[]
[null,null,null,null,null,null,null,null,null,null,null,null,null,null,null,null,null,null,null,null,null,null,{"$f":"Results!H36","v":"0/12"}]
[]
[]
[null,null,null,null,null,null,"Quelle est la situation actuelle dans votre pays en ce qui concerne Q5.4?"]
[null,null,null,"Q5.4 Dans quelle mesure les prestations accordent-elles la priorité aux catégories de population prioritaires, par exemple pour une meilleure utilisation des services hautement prioritaires et pour la protection financière ?\n",null,null,"Veuillez indiquer dans cette zone de texte vos idées, réflexions, évolutions récentes, projets actuels, etc.",null,null,null,null,null,null,null,null,null,null,null,null,null,null,null,1]
[]
[]
[]
[]
[]
[]
[]
[]
[]
[]
[]
[null,null,null,null,null,null,null,null,null,null,null,null,null,null,null,null,null,null,null,null,null,null,{"$f":"Results!H37","v":"0/12"}]
[]
[]
[null,null,null,null,null,null,"Quelle est la situation actuelle dans votre pays en ce qui concerne Q5.5?"]
[null,null,null,"Q5.5 Dans quelle mesure les droits et obligations de la population sont-ils explicitement définis et compris par les intéressés ?\n",null,null,"Veuillez indiquer dans cette zone de texte vos idées, réflexions, évolutions récentes, projets actuels, etc.",null,null,null,null,null,null,null,null,null,null,null,null,null,null,null,1]
[]
[]
[]
[]
[]
[]
[]
[]
[]
[]
[]
[null,null,null,null,null,null,null,null,null,null,null,null,null,null,null,null,null,null,null,null,null,null,{"$f":"Results!H38","v":"0/12"}]
[]
[]
[null,null,null,null,null,null,"Quelle est la situation actuelle dans votre pays en ce qui concerne Q5.6?"]
[null,null,null,"Q5.6 Dans quelle mesure les prestations sont-elles alignées sur le paiement des prestataires, afin de s’assurer qu’elles sont fournies et que les patients bénéficient d’une protection financière ?\n",null,null,"Veuillez indiquer dans cette zone de texte vos idées, réflexions, évolutions récentes, projets actuels, etc.",null,null,null,null,null,null,null,null,null,null,null,null,null,null,null,1]
[]
[]
[]
[]
[]
[]
[]
[]
[]
[]
[]
[null,null,null,null,null,null,null,null,null,null,null,null,null,null,null,null,null,null,null,null,null,null,{"$f":"Results!H39","v":"0/12"}]
[]
[]
[null,null,null,null,null,null,"Quelle est la situation actuelle dans votre pays en ce qui concerne Q5.7?"]
[null,null,null,"Q5.7 Dans quelle mesure les prestations, y compris le partage des coûts pour les patients, sont-elles alignées sur les recettes, afin d’assurer un financement adéquat des droits à prestations approuvés ?\n",null,null,"Veuillez indiquer dans cette zone de texte vos idées, réflexions, évolutions récentes, projets actuels, etc.",null,null,null,null,null,null,null,null,null,null,null,null,null,null,null,1]
[]
[]
[]
[]
[]
[]
[]
[]
[]
[]
[]
[null,null,null,null,null,null,null,null,null,null,null,null,null,null,null,null,null,null,null,null,null,null,{"$f":"Results!H40","v":"0/12"}]
[]
[]
[]
[]
[null,null,null,"Résumez ici les prochaines étapes, priorités ou points d’action que vous avez identifiés après avoir complété cette matrice relative aux Prestations et droits."]
[]
[]
[]
[]
[]
[null,null,null,"Commentaires (retour d’informations sur la conception, la pertinence et la clarté des questions) dans cette matrice relative aux Prestations et droits."]

{"sheet":"PFM","index":19,"n_rows":191,"n_cols":23,"rows_kept":191,"cut":false,"hidden":true,"merged":[[179,22,180,23],[99,22,100,23],[115,22,116,23],[131,22,132,23],[147,22,148,23],[163,22,164,23],[19,22,20,23],[35,22,36,23],[51,22,52,23],[67,22,68,23],[83,22,84,23],[14,6,19,9],[46,6,50,9],[46,10,50,13],[46,17,50,19],[94,6,98,9],[94,10,98,13],[94,14,98,16],[94,17,98,19],[185,3,188,22],[191,3,194,22],[7,3,20,4],[7,6,10,21],[23,3,36,4],[23,6,26,21],[39,3,52,4],[39,6,42,21],[103,3,116,4],[103,6,106,21],[55,3,68,4],[55,6,58,21],[71,3,84,4],[71,6,74,21],[87,3,100,4],[87,6,90,21],[167,6,170,21],[167,3,180,4],[119,3,132,4],[119,6,122,21],[135,3,148,4],[135,6,138,21],[151,6,154,21],[151,3,164,4],[142,6,146,9],[142,17,146,19],[174,17,178,19]]}
[]
[]
[]
[]
[null,null,null,"6. Gestion des finances publiques (GFP)",null,null,null,null,null,null,null," "]
[null," "]
[null,null,null,null,null,null,"Quelle est la situation actuelle dans votre pays en ce qui concerne Q6.1?"]
[null,null,null,"Q6.1 Est-ce qu’un diagnostic/une évaluation approfondi(e) des goulets d’étranglement de la GFP dans le secteur de la santé a été effectué(e) récemment, par exemple au cours des trois dernières années ?",null,null,"Veuillez indiquer dans cette zone de texte vos idées, réflexions, évolutions récentes, projets actuels, etc."]
[]
[]
[]
[]
[]
[]
[]
[]
[]
[]
[]
[null,null,null,null,null,null,null,null,null,null,null,null,null,null,null,null,null,null,null,null,null,null,{"$f":"Results!H41","v":"0/12"}]
[]
[]
[null,null,null,null,null,null,"Quelle est la situation actuelle dans votre pays en ce qui concerne Q6.2?"]
[null,null,null,"Q6.2 Le personnel du Ministère de la santé dispose-t-il de capacités à comprendre les (nouvelles) règles de GFP et à les appliquer au processus budgétaire du secteur de la santé ?",null,null,"Veuillez indiquer dans cette zone de texte vos idées, réflexions, évolutions récentes, projets actuels, etc."]
[]
[]
[]
[]
[]
[]
[]
[]
[]
[]
[]
[null,null,null,null,null,null,null,null,null,null,null,null,null,null,null,null,null,null,null,null,null,null,{"$f":"Results!H42","v":"0/12"}]
[]
[]
[null,null,null,null,null,null,"Quelle est la situation actuelle dans votre pays en ce qui concerne Q6.3?"]
[null,null,null,"Q6.3 Existe-il un processus budgétaire pluriannuel mis en œuvre efficacement ?",null,null,"Veuillez indiquer dans cette zone de texte vos idées, réflexions, évolutions récentes, projets actuels, etc."]
[]
[]
[]
[]
[]
[]
[]
[]
[]
[]
[]
[null,null,null,null,null,null,null,null,null,null,null,null,null,null,null,null,null,null,null,null,null,null,{"$f":"Results!H43","v":"0/12"}]
[]
[]
[null,null,null,null,null,null,"Quelle est la situation actuelle dans votre pays en ce qui concerne Q6.4?"]
[null,null,null,"Q6.4 Dans quelle mesure les allocations budgétaires annuelles en matière de santé sont alignées sur les priorités du secteur de la santé (niveau, structure, nature/objectif) ?",null,null,"Veuillez indiquer dans cette zone de texte vos idées, réflexions, évolutions récentes, projets actuels, etc.",null,null,null,null,null,null,null,null,null,null,null,null,null,null,null,1]
[]
[]
[]
[]
[]
[]
[]
[]
[]
[]
[]
[null,null,null,null,null,null,null,null,null,null,null,null,null,null,null,null,null,null,null,null,null,null,{"$f":"Results!H44","v":"0/12"}]
[]
[]
[null,null,null,null,null,null,"Quelle est la situation actuelle dans votre pays en ce qui concerne Q6.5?"]
[null,null,null,"Q6.5 Dans quelle mesure le processus budgétaire est consultatif, transparent et un processus d’examen et d’ajustement budgétaire à mi-parcours est établi ?",null,null,"Veuillez indiquer dans cette zone de texte vos idées, réflexions, évolutions récentes, projets actuels, etc.",null,null,null,null,null,null,null,null,null,null,null,null,null,null,null,1]
[]
[]
[]
[]
[]
[]
[]
[]
[]
[]
[]
[null,null,null,null,null,null,null,null,null,null,null,null,null,null,null,null,null,null,null,null,null,null,{"$f":"Results!H45","v":"0/12"}]
[]
[]
[null,null,null,null,null,null,"Quelle est la situation actuelle dans votre pays en ce qui concerne Q6.6?"]
[null,null,null,"Q6.6 Dans quelle mesure les transferts fiscaux sont conçus et mis en œuvre de sorte à améliorer l’équité de la distribution des ressources dans le secteur de la santé?",null,null,"Veuillez indiquer dans cette zone de texte vos idées, réflexions, évolutions récentes, projets actuels, etc.",null,null,null,null,null,null,null,null,null,null,null,null,null,null,null,1]
[]
[]
[]
[]
[]
[]
[]
[]
[]
[]
[]
[null,null,null,null,null,null,null,null,null,null,null,null,null,null,null,null,null,null,null,null,null,null,{"$f":"Results!H46","v":"0/12"}]
[]
[]
[null,null,null,null,null,null,"Quelle est la situation actuelle dans votre pays en ce qui concerne Q6.7?"]
[null,null,null,"Q6.7 Dans quelle mesure les règles du budget de la santé permettent-elles une certaine souplesse des dépenses? ",null,null,"Veuillez indiquer dans cette zone de texte vos idées, réflexions, évolutions récentes, projets actuels, etc.",null,null,null,null,null,null,null,null,null,null,null,null,null,null,null,1]
[]
[]
[]
[]
[]
[]
[]
[]
[]
[]
[]
[null,null,null,null,null,null,null,null,null,null,null,null,null,null,null,null,null,null,null,null,null,null,{"$f":"Results!H47","v":"0/12"}]
[]
[]
[null,null,null,null,null,null,"Quelle est la situation actuelle dans votre pays en ce qui concerne Q6.8?"]
[null,null,null,"Q6.8 La flexibilité dans l’utilisation des ressources est-elle assurée ou déléguée au bon niveau?",null,null,"Veuillez indiquer dans cette zone de texte vos idées, réflexions, évolutions récentes, projets actuels, etc.",null,null,null,null,null,null,null,null,null,null,null,null,null,null,null,1]
[]
[]
[]
[]
[]
[]
[]
[]
[]
[]
[]
[null,null,null,null,null,null,null,null,null,null,null,null,null,null,null,null,null,null,null,null,null,null,{"$f":"Results!H48","v":"0/12"}]
[]
[]
[null,null,null,null,null,null,"Quelle est la situation actuelle dans votre pays en ce qui concerne Q6.9?"]
[null,null,null,"Q6.9 Dans quelle mesure des politiques de discipline budgétaire visant à contrôler les dépenses sont en vigueur (par exemple, gestion de la trésorerie, respect des règles d’approvisionnement) et mises en œuvre efficacement?",null,null,"Veuillez indiquer dans cette zone de texte vos idées, réflexions, évolutions récentes, projets actuels, etc.",null,null,null,null,null,null,null,null,null,null,null,null,null,null,null,1]
[]
[]
[]
[]
[]
[]
[]
[]
[]
[]
[]
[null,null,null,null,null,null,null,null,null,null,null,null,null,null,null,null,null,null,null,null,null,null,{"$f":"Results!H49","v":"0/12"}]
[]
[]
[null,null,null,null,null,null,"Quelle est la situation actuelle dans votre pays en ce qui concerne Q6.10?"]
[null,null,null,"Q6.10 Dans quelle mesure des systèmes d’information sont en place pour répondre aux besoins en matière de responsabilité financière et pour assurer le suivi des performances du secteur de la santé?",null,null,"Veuillez indiquer dans cette zone de texte vos idées, réflexions, évolutions récentes, projets actuels, etc."]
[]
[]
[]
[]
[]
[]
[]
[]
[]
[]
[]
[null,null,null,null,null,null,null,null,null,null,null,null,null,null,null,null,null,null,null,null,null,null,{"$f":"Results!H50","v":"0/12"}]
[]
[]
[null,null,null,null,null,null,"Quelle est la situation actuelle dans votre pays en ce qui concerne Q6.11?"]
[null,null,null,"Q6.11 Dans quelle mesure les flux financiers multiples, la structure budgétaire et les règles de GFP sont alignés sur les politiques d’achats stratégiques?",null,null,"Veuillez indiquer dans cette zone de texte vos idées, réflexions, évolutions récentes, projets actuels, etc.",null,null,null,null,null,null,null,null,null,null,null,null,null,null,null,1]
[null,null,null,null,null," "]
[]
[]
[]
[]
[]
[]
[]
[]
[]
[]
[null,null,null,null,null,null,null,null,null,null,null,null,null,null,null,null,null,null,null,null,null,null,{"$f":"Results!H51","v":"0/12"}]
[]
[]
[]
[]
[null,null,null,"Résumez ici les prochaines étapes, priorités ou points d’action que vous avez identifiés après avoir complété cette matrice relative aux Prestations et droits."]
[]
[]
[]
[]
[]
[null,null,null,"Commentaires (retour d’informations sur la conception, la pertinence et la clarté des questions) dans cette matrice relative aux Prestations et droits."]

{"sheet":"Governance","index":20,"n_rows":111,"n_cols":23,"rows_kept":111,"cut":false,"hidden":true,"merged":[[67,22,68,23],[83,22,84,23],[99,22,100,23],[105,3,108,22],[111,3,114,22],[55,3,68,4],[55,6,58,21],[71,3,84,4],[71,6,74,21],[87,3,100,4],[87,6,90,21],[19,22,20,23],[35,22,36,23],[51,22,52,23],[7,3,20,4],[7,6,10,21],[23,3,36,4],[23,6,26,21],[39,3,52,4],[39,6,42,21]]}
[]
[]
[]
[]
[null,null,null,"7. Gouvernance",null,null,null,null,null,null,null," "]
[]
[null,null,null,null,null,null,"Quelle est la situation actuelle dans votre pays en ce qui concerne Q7.1?"]
[null,null,null,"Q7.1 Dans quelle mesure les rôles et les responsabilités (liés aux objectifs de financement de la santé et au rendement en matière de collecte de recettes, de mise en commun, d’achats, de prestations, etc.) sont clairement définis et répartis entre les institutions responsables du financement de la santé ?",null,null,"Veuillez indiquer dans cette zone de texte vos idées, réflexions, évolutions récentes, projets actuels, etc.",null,null,null,null,null,null,null,null,null,null,null,null,null,null,null,1]
[]
[]
[]
[]
[]
[]
[]
[]
[]
[]
[]
[null,null,null,null,null,null,null,null,null,null,null,null,null,null,null,null,null,null,null,null,null,null,{"$f":"Results!H52","v":"0/12"}]
[]
[]
[null,null,null,null,null,null,"Quelle est la situation actuelle dans votre pays en ce qui concerne Q7.2?"]
[null,null,null,"Q7.2 Dans quelle mesure les institutions responsables du financement de la santé disposent-elles de capacités adéquates, notamment en matière de ressources humaines (capacités techniques et managériales) et de TIC ?",null,null,"Veuillez indiquer dans cette zone de texte vos idées, réflexions, évolutions récentes, projets actuels, etc.",null,null,null,null,null,null,null,null,null,null,null,null,null,null,null,1]
[]
[]
[]
[]
[]
[]
[]
[]
[]
[]
[]
[null,null,null,null,null,null,null,null,null,null,null,null,null,null,null,null,null,null,null,null,null,null,{"$f":"Results!H53","v":"0/12"}]
[]
[]
[null,null,null,null,null,null,"Quelle est la situation actuelle dans votre pays en ce qui concerne Q7.3?"]
[null,null,null,"Q7.3 Dans quelle mesure les mécanismes de responsabilisation des organismes d’achat/de financement (y compris l’autonomie et le conseil d’administration de l’agence d’assurance-maladie, les mécanismes de récompense/sanction, etc.) sont-ils en place pour s’assurer que la politique de financement de la santé appuie les progrès vers les objectifs du secteur et que les fonds sont utilisés efficacement pour les populations, programmes et services prioritaires ?",null,null,"Veuillez indiquer dans cette zone de texte vos idées, réflexions, évolutions récentes, projets actuels, etc.",null,null,null,null,null,null,null,null,null,null,null,null,null,null,null,1]
[]
[]
[]
[]
[]
[]
[]
[]
[]
[]
[]
[null,null,null,null,null,null,null,null,null,null,null,null,null,null,null,null,null,null,null,null,null,null,{"$f":"Results!H54","v":"0/12"}]
[]
[]
[null,null,null,null,null,null,"Quelle est la situation actuelle dans votre pays en ce qui concerne Q7.4?"]
[null,null,null,"Q7.4 L’utilisation des fonds ou les performances des institutions achetant des services auprès des prestataires de services de santé ou le budget de la santé ont-ils été communiqués au public (par exemple sous forme de rapport annuel) ?",null,null,"Veuillez indiquer dans cette zone de texte vos idées, réflexions, évolutions récentes, projets actuels, etc.",null,null,null,null,null,null,null,null,null,null,null,null,null,null,null,1]
[]
[]
[]
[]
[]
[]
[]
[]
[]
[]
[]
[null,null,null,null,null,null,null,null,null,null,null,null,null,null,null,null,null,null,null,null,null,null,{"$f":"Results!H55","v":"0/12"}]
[]
[]
[null,null,null,null,null,null,"Quelle est la situation actuelle dans votre pays en ce qui concerne Q7.5?"]
[null,null,null,"Q7.5 Dans quelle mesure le Ministère des finances, le Ministère de la santé et l’organisme national d’assurance-maladie participent au processus d’élaboration des politiques de financement de la santé et en sont informés ?",null,null,"Veuillez indiquer dans cette zone de texte vos idées, réflexions, évolutions récentes, projets actuels, etc.",null,null,null,null,null,null,null,null,null,null,null,null,null,null,null,1]
[]
[]
[]
[]
[]
[]
[]
[]
[]
[]
[]
[null,null,null,null,null,null,null,null,null,null,null,null,null,null,null,null,null,null,null,null,null,null,{"$f":"Results!H56","v":"0/12"}]
[]
[]
[null,null,null,null,null,null,"Quelle est la situation actuelle dans votre pays en ce qui concerne Q7.6?"]
[null,null,null,"Q7.6 Dans quelle mesure le processus d’élaboration des politiques de financement de la santé est transparent et participatif?",null,null,"Veuillez indiquer dans cette zone de texte vos idées, réflexions, évolutions récentes, projets actuels, etc.",null,null,null,null,null,null,null,null,null,null,null,null,null,null,null,1]
[]
[]
[]
[]
[]
[]
[]
[]
[]
[]
[]
[null,null,null,null,null,null,null,null,null,null,null,null,null,null,null,null,null,null,null,null,null,null,{"$f":"Results!H57","v":"0/12"}]
[]
[]
[]
[]
[null,null,null,"Résumez ici les prochaines étapes, priorités ou points d’action que vous avez identifiés après avoir complété cette matrice relative aux Prestations et droits."]
[]
[]
[]
[]
[]
[null,null,null,"Commentaires (retour d’informations sur la conception, la pertinence et la clarté des questions) dans cette matrice relative aux Prestations et droits."]

{"sheet":"Efficiency","index":21,"n_rows":234,"n_cols":23,"rows_kept":234,"cut":false,"hidden":true,"merged":[[185,22,186,23],[201,22,202,23],[217,22,218,23],[233,22,234,23],[101,22,102,23],[119,22,120,23],[135,22,136,23],[151,22,152,23],[167,22,168,23],[19,22,20,23],[37,22,38,23],[53,22,54,23],[69,22,70,23],[85,22,86,23],[7,3,20,4],[7,6,10,21],[14,6,18,8],[14,10,18,12],[14,14,18,15],[14,17,18,19],[25,3,38,4],[25,6,28,21],[32,6,36,8],[32,10,36,12],[32,14,36,15],[32,17,36,19],[41,3,54,4],[41,6,44,21],[48,6,52,8],[48,10,52,12],[48,14,52,15],[48,17,52,19],[57,3,70,4],[57,6,60,21],[64,6,68,8],[64,10,68,12],[64,14,68,15],[64,17,68,19],[73,3,86,4],[73,6,76,21],[80,6,84,8],[80,10,84,12],[80,14,84,15],[80,17,84,19],[89,3,102,4],[89,6,92,21],[96,6,100,8],[96,10,100,12],[96,14,100,15],[96,17,100,19],[123,3,136,4],[123,6,126,21],[107,3,120,4],[107,6,110,21],[114,17,118,19],[139,3,152,4],[139,6,142,21],[155,3,168,4],[155,6,158,21],[162,12,166,19],[221,3,234,4],[221,6,224,21],[228,17,232,19],[173,3,186,4],[173,6,176,21],[205,3,218,4],[205,6,208,21],[212,6,216,9],[212,17,216,19],[189,3,202,4],[189,6,192,21]]}
[]
[]
[]
[]
[null,null,null,"Efficience",null,null,null,null,null,null,null," "]
[]
[null,null,null,null,null,null,"Quelle est la situation actuelle dans votre pays en ce qui concerne Q2.4?"]
[null,null,null,"Q2.4 Dans quelle mesure le flux de fonds publics est-il stable, notamment grâce à une exécution budgétaire régulière, c’est-à-dire un déblocage des fonds dans les délais, conformément aux budgets de santé approuvés ?\n",null,null,"Veuillez indiquer dans cette zone de texte vos idées, réflexions, évolutions récentes, projets actuels, etc.",null,null,null,null,null,null,null,null,null,null,null,null,null,null,null,1]
[]
[]
[]
[]
[]
[]
[]
[]
[]
[]
[]
[null,null,null,null,null,null,null,null,null,null,null,null,null,null,null,null,null,null,null,null,null,null,{"$f":"Results!H15","v":"0/12"}]
[]
[]
[]
[]
[null,null,null,null,null,null,"Quelle est la situation actuelle dans votre pays en ce qui concerne Q3.2?"]
[null,null,null,"Q3.2 Dans le cadre du processus global d’élaboration et de planification de la mise en œuvre des politiques de financement de la santé, quelle est l’approche de votre pays en matière de dispositifs de mise en commun des ressources ?",null,null,"Veuillez indiquer dans cette zone de texte vos idées, réflexions, évolutions récentes, projets actuels, etc.",null,null,null,null,null,null,null,null,null,null,null,null,null,null,null,1]
[]
[]
[]
[]
[]
[]
[]
[]
[]
[]
[]
[null,null,null,null,null,null,null,null,null,null,null,null,null,null,null,null,null,null,null,null,null,null,{"$f":"Results!H18","v":"0/12"}]
[]
[]
[null,null,null,null,null,null,"Quelle est la situation actuelle dans votre pays en ce qui concerne Q3.3?"]
[null,null,null,"Q3.3 Dans quelle mesure la capacité de redistribution des fonds prépayés dans votre pays est-elle limitée par le cadre institutionnel du financement de la santé ?",null,null,"Veuillez indiquer dans cette zone de texte vos idées, réflexions, évolutions récentes, projets actuels, etc.",null,null,null,null,null,null,null,null,null,null,null,null,null,null,null,1]
[]
[]
[]
[]
[]
[]
[]
[]
[]
[]
[]
[null,null,null,null,null,null,null,null,null,null,null,null,null,null,null,null,null,null,null,null,null,null,{"$f":"Results!H19","v":"0/12"}]
[]
[]
[null,null,null,null,null,null,"Quelle est la situation actuelle dans votre pays en ce qui concerne Q3.4?"]
[null,null,null,"Q3.4  Y-a-il des mesures, dans la conception des prestations, le paiement des prestataires ou les systèmes sous-jacents non financiers, qui visent à contrecarrer les problèmes découlant de la fragmentation de l’architecture du financement de la santé ?\n",null,null,"Veuillez indiquer dans cette zone de texte vos idées, réflexions, évolutions récentes, projets actuels, etc.",null,null,null,null,null,null,null,null,null,null,null,null,null,null,null,1]
[]
[]
[]
[]
[]
[]
[]
[]
[]
[]
[]
[null,null,null,null,null,null,null,null,null,null,null,null,null,null,null,null,null,null,null,null,null,null,{"$f":"Results!H20","v":"0/12"}]
[]
[]
[null,null,null,null,null,null,"Quelle est la situation actuelle dans votre pays en ce qui concerne Q3.5?"]
[null,null,null,"Q3.5 Dans quelle mesure les différentes sources de recettes et de financement sont-elles organisées de manière complémentaire, afin de financer un paquet de prestations pour l’ensemble de la population ?\n",null,null,"Veuillez indiquer dans cette zone de texte vos idées, réflexions, évolutions récentes, projets actuels, etc.",null,null,null,null,null,null,null,null,null,null,null,null,null,null,null,1]
[]
[]
[]
[]
[]
[]
[]
[]
[]
[]
[]
[null,null,null,null,null,null,null,null,null,null,null,null,null,null,null,null,null,null,null,null,null,null,{"$f":"Results!H21","v":"0/12"}]
[]
[]
[null,null,null,null,null,null,"Quelle est la situation actuelle dans votre pays en ce qui concerne Q3.7?"]
[null,null,null,"Q3.7 Dans quelle mesure les flux financiers sont-ils incohérents et redondants, et empêchent d’utiliser efficacement le budget public et les fonds des donateurs ?",null,null,"Veuillez indiquer dans cette zone de texte vos idées, réflexions, évolutions récentes, projets actuels, etc.",null,null,null,null,null,null,null,null,null,null,null,null,null,null,null,0]
[]
[]
[]
[]
[]
[]
[]
[]
[]
[]
[]
[null,null,null,null,null,null,null,null,null,null,null,null,null,null,null,null,null,null,null,null,null,null,{"$f":"Results!H23","v":"0/12"}]
[]
[]
[]
[]
[null,null,null,null,null,null,"Quelle est la situation actuelle dans votre pays en ce qui concerne Q4.5?"]
[null,null,null,"Q4.5 Dans quelle mesure les méthodes de paiement des prestataires favorisent-elles l’efficacité de l’allocation des ressources, par exemple en réduisant la prestation excessive ou en augmentant celle insuffisante des services, et gèrent-elles la croissance des dépenses ?\n",null,null,"Veuillez indiquer dans cette zone de texte vos idées, réflexions, évolutions récentes, projets actuels, etc.",null,null,null,null,null,null,null,null,null,null,null,null,null,null,null,0]
[]
[]
[]
[]
[]
[]
[]
[]
[]
[]
[]
[null,null,null,null,null,null,null,null,null,null,null,null,null,null,null,null,null,null,null,null,null,null,{"$f":"Results!H28","v":"0/12"}]
[]
[]
[null,null,null,null,null,null,"Quelle est la situation actuelle dans votre pays en ce qui concerne Q4.8?"]
[null,null,null,"Q4.8 Dans quelle mesure les prestataires jouissent-ils d’une autonomie financière et sont-ils tenus responsables, dans une mesure réaliste et conforme à leurs capacités ?\n",null,null,"Veuillez indiquer dans cette zone de texte vos idées, réflexions, évolutions récentes, projets actuels, etc.",null,null,null,null,null,null,null,null,null,null,null,null,null,null,null,1]
[]
[]
[]
[]
[]
[]
[]
[]
[]
[]
[]
[null,null,null,null,null,null,null,null,null,null,null,null,null,null,null,null,null,null,null,null,null,null,{"$f":"Results!H31","v":"0/12"}]
[]
[]
[null,null,null,null,null,null,"Quelle est la situation actuelle dans votre pays en ce qui concerne Q4.9?"]
[null,null,null,"Q4.9 Dans quelle mesure l’accréditation des prestataires ou les contrats sélectifs sont-ils établis, fonctionnels et utilisés pour les achats ?\n",null,null,"Veuillez indiquer dans cette zone de texte vos idées, réflexions, évolutions récentes, projets actuels, etc.",null,null,null,null,null,null,null,null,null,null,null,null,null,null,null,0]
[]
[]
[]
[]
[]
[]
[]
[]
[]
[]
[]
[null,null,null,null,null,null,null,null,null,null,null,null,null,null,null,null,null,null,null,null,null,null,{"$f":"Results!H32","v":"0/12"}]
[]
[]
[null,null,null,null,null,null,"Quelle est la situation actuelle dans votre pays en ce qui concerne Q4.10?"]
[null,null,null,"Q4.10 Dans quelle mesure l’achat et le paiement des produits pharmaceutiques sont-ils mis en œuvre pour promouvoir l’utilisation efficace des médicaments (par exemple le recours aux génériques plutôt qu’aux princeps) et pour améliorer la protection financière des patients ?\n",null,null,"Veuillez indiquer dans cette zone de texte vos idées, réflexions, évolutions récentes, projets actuels, etc.",null,null,null,null,null,null,null,null,null,null,null,null,null,null,null,1]
[]
[]
[]
[]
[]
[]
[]
[]
[]
[]
[]
[null,null,null,null,null,null,null,null,null,null,null,null,null,null,null,null,null,null,null,null,null,null,{"$f":"Results!H33","v":"0/12"}]
[]
[]
[]
[]
[null,null,null,null,null,null,"Quelle est la situation actuelle dans votre pays en ce qui concerne Q6.7?"]
[null,null,null,"Q6.7 Dans quelle mesure les règles du budget de la santé permettent-elles une certaine souplesse des dépenses? ",null,null,"Veuillez indiquer dans cette zone de texte vos idées, réflexions, évolutions récentes, projets actuels, etc.",null,null,null,null,null,null,null,null,null,null,null,null,null,null,null,1]
[]
[]
[]
[]
[]
[]
[]
[]
[]
[]
[]
[null,null,null,null,null,null,null,null,null,null,null,null,null,null,null,null,null,null,null,null,null,null,{"$f":"Results!H47","v":"0/12"}]
[]
[]
[null,null,null,null,null,null,"Quelle est la situation actuelle dans votre pays en ce qui concerne Q6.8?"]
[null,null,null,"Q6.8 La flexibilité dans l’utilisation des ressources est-elle assurée ou déléguée au bon niveau?",null,null,"Veuillez indiquer dans cette zone de texte vos idées, réflexions, évolutions récentes, projets actuels, etc.",null,null,null,null,null,null,null,null,null,null,null,null,null,null,null,0]
[]
[]
[]
[]
[]
[]
[]
[]
[]
[]
[]
[null,null,null,null,null,null,null,null,null,null,null,null,null,null,null,null,null,null,null,null,null,null,{"$f":"Results!H48","v":"0/12"}]
[]
[]
[null,null,null,null,null,null,"Quelle est la situation actuelle dans votre pays en ce qui concerne Q6.9?"]
[null,null,null,"Q6.9 Dans quelle mesure des politiques de discipline budgétaire visant à contrôler les dépenses sont en vigueur (par exemple, gestion de la trésorerie, respect des règles d’approvisionnement) et mises en œuvre efficacement?",null,null,"Veuillez indiquer dans cette zone de texte vos idées, réflexions, évolutions récentes, projets actuels, etc.",null,null,null,null,null,null,null,null,null,null,null,null,null,null,null,1]
[]
[]
[]
[]
[]
[]
[]
[]
[]
[]
[]
[null,null,null,null,null,null,null,null,null,null,null,null,null,null,null,null,null,null,null,null,null,null,{"$f":"Results!H49","v":"0/12"}]
[]
[]
[null,null,null,null,null,null,"Quelle est la situation actuelle dans votre pays en ce qui concerne Q6.11?"]
[null,null,null,"Q6.11 Dans quelle mesure les flux financiers multiples, la structure budgétaire et les règles de GFP sont alignés sur les politiques d’achats stratégiques?",null,null,"Veuillez indiquer dans cette zone de texte vos idées, réflexions, évolutions récentes, projets actuels, etc.",null,null,null,null,null,null,null,null,null,null,null,null,null,null,null,1]
[null,null,null,null,null," "]
[]
[]
[]
[]
[]
[]
[]
[]
[]
[]
[null,null,null,null,null,null,null,null,null,null,null,null,null,null,null,null,null,null,null,null,null,null,{"$f":"Results!H51","v":"0/12"}]

{"sheet":"Equity_Reso","index":22,"n_rows":168,"n_cols":23,"rows_kept":168,"cut":false,"hidden":true,"merged":[[101,22,102,23],[117,22,118,23],[135,22,136,23],[151,22,152,23],[167,22,168,23],[19,22,20,23],[35,22,36,23],[51,22,52,23],[67,22,68,23],[83,22,84,23],[105,3,118,4],[105,6,108,21],[23,3,36,4],[23,6,26,21],[30,6,34,8],[30,10,34,12],[30,14,34,15],[30,17,34,19],[39,3,52,4],[39,6,42,21],[46,6,50,8],[46,10,50,12],[46,14,50,15],[46,17,50,19],[55,3,68,4],[55,6,58,21],[7,3,20,4],[7,6,10,21],[14,6,18,8],[14,10,18,12],[14,14,18,15],[14,17,18,19],[62,6,66,8],[62,10,66,12],[62,14,66,15],[62,17,66,19],[89,3,102,4],[89,6,92,21],[71,3,84,4],[71,6,74,21],[78,6,82,8],[78,10,82,12],[78,14,82,15],[78,17,82,19],[155,3,168,4],[155,6,158,21],[162,17,166,19],[123,3,136,4],[123,6,126,21],[139,3,152,4],[139,6,142,21],[146,6,150,9],[146,10,150,13],[146,14,150,16],[146,17,150,19]]}
[]
[]
[]
[]
[null,null,null,"Équité dans la distribution des ressources",null,null,null,null,null,null,null," "]
[]
[null,null,null,null,null,null,"Quelle est la situation actuelle dans votre pays en ce qui concerne Q3.2?"]
[null,null,null,"Q3.2 Dans le cadre du processus global d’élaboration et de planification de la mise en œuvre des politiques de financement de la santé, quelle est l’approche de votre pays en matière de dispositifs de mise en commun des ressources ?",null,null,"Veuillez indiquer dans cette zone de texte vos idées, réflexions, évolutions récentes, projets actuels, etc.",null,null,null,null,null,null,null,null,null,null,null,null,null,null,null,0]
[]
[]
[]
[]
[]
[]
[]
[]
[]
[]
[]
[null,null,null,null,null,null,null,null,null,null,null,null,null,null,null,null,null,null,null,null,null,null,{"$f":"Results!H18","v":"0/12"}]
[]
[]
[null,null,null,null,null,null,"Quelle est la situation actuelle dans votre pays en ce qui concerne Q3.3?"]
[null,null,null,"Q3.3 Dans quelle mesure la capacité de redistribution des fonds prépayés dans votre pays est-elle limitée par le cadre institutionnel du financement de la santé ?",null,null,"Veuillez indiquer dans cette zone de texte vos idées, réflexions, évolutions récentes, projets actuels, etc.",null,null,null,null,null,null,null,null,null,null,null,null,null,null,null,0]
[]
[]
[]
[]
[]
[]
[]
[]
[]
[]
[]
[null,null,null,null,null,null,null,null,null,null,null,null,null,null,null,null,null,null,null,null,null,null,{"$f":"Results!H19","v":"0/12"}]
[]
[]
[null,null,null,null,null,null,"Quelle est la situation actuelle dans votre pays en ce qui concerne Q3.4?"]
[null,null,null,"Q3.4  Y-a-il des mesures, dans la conception des prestations, le paiement des prestataires ou les systèmes sous-jacents non financiers, qui visent à contrecarrer les problèmes découlant de la fragmentation de l’architecture du financement de la santé ?\n",null,null,"Veuillez indiquer dans cette zone de texte vos idées, réflexions, évolutions récentes, projets actuels, etc.",null,null,null,null,null,null,null,null,null,null,null,null,null,null,null,1]
[]
[]
[]
[]
[]
[]
[]
[]
[]
[]
[]
[null,null,null,null,null,null,null,null,null,null,null,null,null,null,null,null,null,null,null,null,null,null,{"$f":"Results!H20","v":"0/12"}]
[]
[]
[null,null,null,null,null,null,"Quelle est la situation actuelle dans votre pays en ce qui concerne Q3.5?"]
[null,null,null,"Q3.5 Dans quelle mesure les différentes sources de recettes et de financement sont-elles organisées de manière complémentaire, afin de financer un paquet de prestations pour l’ensemble de la population ?\n",null,null,"Veuillez indiquer dans cette zone de texte vos idées, réflexions, évolutions récentes, projets actuels, etc.",null,null,null,null,null,null,null,null,null,null,null,null,null,null,null,0]
[]
[]
[]
[]
[]
[]
[]
[]
[]
[]
[]
[null,null,null,null,null,null,null,null,null,null,null,null,null,null,null,null,null,null,null,null,null,null,{"$f":"Results!H21","v":"0/12"}]
[]
[]
[null,null,null,null,null,null,"Quelle est la situation actuelle dans votre pays en ce qui concerne Q3.6?"]
[null,null,null,"Q3.6 Dans quelle mesure les dispositifs d’assurance-maladie volontaire sont-ils une source d’inégalités, créant des effets de contagion potentiellement néfastes pour l’ensemble du système de santé ?\n",null,null,"Veuillez indiquer dans cette zone de texte vos idées, réflexions, évolutions récentes, projets actuels, etc.",null,null,null,null,null,null,null,null,null,null,null,null,null,null,null,1]
[]
[]
[]
[]
[]
[]
[]
[]
[]
[]
[]
[null,null,null,null,null,null,null,null,null,null,null,null,null,null,null,null,null,null,null,null,null,null,{"$f":"Results!H22","v":"0/12"}]
[]
[]
[]
[]
[null,null,null,null,null,null,"Quelle est la situation actuelle dans votre pays en ce qui concerne Q4.1?"]
[null,null,null,"Q4.1 Dans quelle mesure les allocations de fonds aux acheteurs de niveau inférieur, par exemple les administrations locales, et/ou les taux de paiement aux prestataires sont-ils le reflet des besoins de santé de la population ?\n",null,null,"Veuillez indiquer dans cette zone de texte vos idées, réflexions, évolutions récentes, projets actuels, etc.",null,null,null,null,null,null,null,null,null,null,null,null,null,null,null,0]
[]
[]
[]
[]
[]
[]
[]
[]
[]
[]
[]
[null,null,null,null,null,null,null,null,null,null,null,null,null,null,null,null,null,null,null,null,null,null,{"$f":"Results!H24","v":"0/12"}]
[]
[]
[null,null,null,null,null,null,"Quelle est la situation actuelle dans votre pays en ce qui concerne Q4.2?"]
[null,null,null,"Q4.2 Dans quelle mesure les paiements des prestataires sont-ils harmonisés entre régimes/sources de revenus et entre secteurs public et privé, afin de garantir des incitations cohérentes aux prestataires ?\n",null,null,"Veuillez indiquer dans cette zone de texte vos idées, réflexions, évolutions récentes, projets actuels, etc.",null,null,null,null,null,null,null,null,null,null,null,null,null,null,null,0]
[]
[]
[]
[]
[]
[]
[]
[]
[]
[]
[]
[null,null,null,null,null,null,null,null,null,null,null,null,null,null,null,null,null,null,null,null,null,null,{"$f":"Results!H25","v":"0/12"}]
[]
[]
[]
[]
[null,null,null,null,null,null,"Quelle est la situation actuelle dans votre pays en ce qui concerne Q6.4?"]
[null,null,null,"Q6.4 Dans quelle mesure les allocations budgétaires annuelles en matière de santé sont alignées sur les priorités du secteur de la santé (niveau, structure, nature/objectif) ?",null,null,"Veuillez indiquer dans cette zone de texte vos idées, réflexions, évolutions récentes, projets actuels, etc.",null,null,null,null,null,null,null,null,null,null,null,null,null,null,null,0]
[]
[]
[]
[]
[]
[]
[]
[]
[]
[]
[]
[null,null,null,null,null,null,null,null,null,null,null,null,null,null,null,null,null,null,null,null,null,null,{"$f":"Results!H44","v":"0/12"}]
[]
[]
[null,null,null,null,null,null,"Quelle est la situation actuelle dans votre pays en ce qui concerne Q6.6?"]
[null,null,null,"Q6.6 Dans quelle mesure les transferts fiscaux sont conçus et mis en œuvre de sorte à améliorer l’équité de la distribution des ressources dans le secteur de la santé?",null,null,"Veuillez indiquer dans cette zone de texte vos idées, réflexions, évolutions récentes, projets actuels, etc.",null,null,null,null,null,null,null,null,null,null,null,null,null,null,null,0]
[]
[]
[]
[]
[]
[]
[]
[]
[]
[]
[]
[null,null,null,null,null,null,null,null,null,null,null,null,null,null,null,null,null,null,null,null,null,null,{"$f":"Results!H46","v":"0/12"}]
[]
[]
[null,null,null,null,null,null,"Quelle est la situation actuelle dans votre pays en ce qui concerne Q6.11?"]
[null,null,null,"Q6.11 Dans quelle mesure les flux financiers multiples, la structure budgétaire et les règles de GFP sont alignés sur les politiques d’achats stratégiques?",null,null,"Veuillez indiquer dans cette zone de texte vos idées, réflexions, évolutions récentes, projets actuels, etc.",null,null,null,null,null,null,null,null,null,null,null,null,null,null,null,0]
[null,null,null,null,null," "]
[]
[]
[]
[]
[]
[]
[]
[]
[]
[]
[null,null,null,null,null,null,null,null,null,null,null,null,null,null,null,null,null,null,null,null,null,null,{"$f":"Results!H51","v":"0/12"}]

{"sheet":"Transp_accoun","index":23,"n_rows":268,"n_cols":23,"rows_kept":268,"cut":false,"hidden":true,"merged":[[267,22,268,23],[187,22,188,23],[203,22,204,23],[219,22,220,23],[235,22,236,23],[251,22,252,23],[103,22,104,23],[119,22,120,23],[137,22,138,23],[153,22,154,23],[169,22,170,23],[19,22,20,23],[35,22,36,23],[53,22,54,23],[69,22,70,23],[87,22,88,23],[7,3,20,4],[7,6,10,21],[14,6,18,8],[14,10,18,12],[14,14,18,15],[14,17,18,19],[23,3,36,4],[23,6,26,21],[30,6,34,8],[30,10,34,12],[30,14,34,15],[30,17,34,19],[57,3,70,4],[57,6,60,21],[41,3,54,4],[41,6,44,21],[48,17,52,19],[125,3,138,4],[125,6,128,21],[91,3,104,4],[91,6,94,21],[75,3,88,4],[75,6,78,21],[107,3,120,4],[107,6,110,21],[175,3,188,4],[175,6,178,21],[191,3,204,4],[191,6,194,21],[141,3,154,4],[141,6,144,21],[157,3,170,4],[157,6,160,21],[164,6,168,9],[164,17,168,19],[255,3,268,4],[255,6,258,21],[207,3,220,4],[207,6,210,21],[223,3,236,4],[223,6,226,21],[239,3,252,4],[239,6,242,21]]}
[]
[]
[]
[]
[null,null,null,"Transparence et responsabilité",null,null,null,null,null,null,null," "]
[]
[null,null,null,null,null,null,"Quelle est la situation actuelle dans votre pays en ce qui concerne Q2.1?"]
[null,null,null,"Q2.1 Quelle approche est en vigueur dans votre pays en matière d’élaboration de politiques et de stratégies de collecte de revenus ? Cette approche s'inscrit-elle dans le cadre du processus global d’élaboration et de planification de la mise en œuvre des politiques de financement de la santé ?\n",null,null,"Veuillez indiquer dans cette zone de texte vos idées, réflexions, évolutions récentes, projets actuels, etc.",null,null,null,null,null,null,null,null,null,null,null,null,null,null,null,0]
[]
[]
[]
[]
[]
[]
[]
[]
[]
[]
[]
[null,null,null,null,null,null,null,null,null,null,null,null,null,null,null,null,null,null,null,null,null,null,{"$f":"Results!H12","v":"0/12"}]
[]
[]
[null,null,null,null,null,null,"Quelle est la situation actuelle dans votre pays en ce qui concerne Q2.3?"]
[null,null,null,"Q2.3 Dans quelle mesure le financement public de la santé dans votre pays est-il prédictible sur plusieurs années ?\n",null,null,"Veuillez indiquer dans cette zone de texte vos idées, réflexions, évolutions récentes, projets actuels, etc.",null,null,null,null,null,null,null,null,null,null,null,null,null,null,null,0]
[]
[]
[]
[]
[]
[]
[]
[]
[]
[]
[]
[null,null,null,null,null,null,null,null,null,null,null,null,null,null,null,null,null,null,null,null,null,null,{"$f":"Results!H14","v":"0/12"}]
[]
[]
[]
[]
[null,null,null,null,null,null,"Quelle est la situation actuelle dans votre pays en ce qui concerne Q4.4?"]
[null,null,null,"Q4.4 Dans quelle mesure les contrats d’achat précisent-ils des exigences en matière de qualité des soins, y compris la disponibilité et la pertinence des soins, puis vérifient-ils de façon régulière qu’elles sont bien respectées ?\n",null,null,"Veuillez indiquer dans cette zone de texte vos idées, réflexions, évolutions récentes, projets actuels, etc.",null,null,null,null,null,null,null,null,null,null,null,null,null,null,null,0]
[]
[]
[]
[]
[]
[]
[]
[]
[]
[]
[]
[null,null,null,null,null,null,null,null,null,null,null,null,null,null,null,null,null,null,null,null,null,null,{"$f":"Results!H27","v":"0/12"}]
[]
[]
[null,null,null,null,null,null,"Quelle est la situation actuelle dans votre pays en ce qui concerne Q4.8?"]
[null,null,null,"Q4.8 Dans quelle mesure les prestataires jouissent-ils d’une autonomie financière et sont-ils tenus responsables, dans une mesure réaliste et conforme à leurs capacités ?\n",null,null,"Veuillez indiquer dans cette zone de texte vos idées, réflexions, évolutions récentes, projets actuels, etc.",null,null,null,null,null,null,null,null,null,null,null,null,null,null,null,0]
[]
[]
[]
[]
[]
[]
[]
[]
[]
[]
[]
[null,null,null,null,null,null,null,null,null,null,null,null,null,null,null,null,null,null,null,null,null,null,{"$f":"Results!H31","v":"0/12"}]
[]
[]
[]
[]
[null,null,null,null,null,null,"Quelle est la situation actuelle dans votre pays en ce qui concerne Q5.2?"]
[null,null,null,"Q5.2 Dans quelle mesure les décisions et les révisions relatives aux prestations sont-elles prises de manière transparente, sur la base d’un processus clairement défini et de critères convenus, tels que le rapport coût-efficacité, la protection financière, l’impact budgétaire ?\n",null,null,"Veuillez indiquer dans cette zone de texte vos idées, réflexions, évolutions récentes, projets actuels, etc.",null,null,null,null,null,null,null,null,null,null,null,null,null,null,null,0]
[]
[]
[]
[]
[]
[]
[]
[]
[]
[]
[]
[null,null,null,null,null,null,null,null,null,null,null,null,null,null,null,null,null,null,null,null,null,null,{"$f":"Results!H35","v":"0/12"}]
[]
[]
[null,null,null,null,null,null,"Quelle est la situation actuelle dans votre pays en ce qui concerne Q5.5?"]
[null,null,null,"Q5.5 Dans quelle mesure les droits et obligations de la population sont-ils explicitement définis et compris par les intéressés ?\n",null,null,"Veuillez indiquer dans cette zone de texte vos idées, réflexions, évolutions récentes, projets actuels, etc.",null,null,null,null,null,null,null,null,null,null,null,null,null,null,null,0]
[]
[]
[]
[]
[]
[]
[]
[]
[]
[]
[]
[null,null,null,null,null,null,null,null,null,null,null,null,null,null,null,null,null,null,null,null,null,null,{"$f":"Results!H38","v":"0/12"}]
[]
[]
[null,null,null,null,null,null,"Quelle est la situation actuelle dans votre pays en ce qui concerne Q5.7?"]
[null,null,null,"Q5.7 Dans quelle mesure les prestations, y compris le partage des coûts pour les patients, sont-elles alignées sur les recettes, afin d’assurer un financement adéquat des droits à prestations approuvés ?\n",null,null,"Veuillez indiquer dans cette zone de texte vos idées, réflexions, évolutions récentes, projets actuels, etc.",null,null,null,null,null,null,null,null,null,null,null,null,null,null,null,0]
[]
[]
[]
[]
[]
[]
[]
[]
[]
[]
[]
[null,null,null,null,null,null,null,null,null,null,null,null,null,null,null,null,null,null,null,null,null,null,{"$f":"Results!H40","v":"0/12"}]
[]
[]
[]
[]
[null,null,null,null,null,null,"Quelle est la situation actuelle dans votre pays en ce qui concerne Q6.5?"]
[null,null,null,"Q6.5 Dans quelle mesure le processus budgétaire est consultatif, transparent et un processus d’examen et d’ajustement budgétaire à mi-parcours est établi ?",null,null,"Veuillez indiquer dans cette zone de texte vos idées, réflexions, évolutions récentes, projets actuels, etc.",null,null,null,null,null,null,null,null,null,null,null,null,null,null,null,0]
[]
[]
[]
[]
[]
[]
[]
[]
[]
[]
[]
[null,null,null,null,null,null,null,null,null,null,null,null,null,null,null,null,null,null,null,null,null,null,{"$f":"Results!H45","v":"0/12"}]
[]
[]
[null,null,null,null,null,null,"Quelle est la situation actuelle dans votre pays en ce qui concerne Q6.7?"]
[null,null,null,"Q6.7 Dans quelle mesure les règles du budget de la santé permettent-elles une certaine souplesse des dépenses? ",null,null,"Veuillez indiquer dans cette zone de texte vos idées, réflexions, évolutions récentes, projets actuels, etc.",null,null,null,null,null,null,null,null,null,null,null,null,null,null,null,0]
[]
[]
[]
[]
[]
[]
[]
[]
[]
[]
[]
[null,null,null,null,null,null,null,null,null,null,null,null,null,null,null,null,null,null,null,null,null,null,{"$f":"Results!H47","v":"0/12"}]
[]
[]
[null,null,null,null,null,null,"Quelle est la situation actuelle dans votre pays en ce qui concerne Q6.9?"]
[null,null,null,"Q6.9 Dans quelle mesure des politiques de discipline budgétaire visant à contrôler les dépenses sont en vigueur (par exemple, gestion de la trésorerie, respect des règles d’approvisionnement) et mises en œuvre efficacement?",null,null,"Veuillez indiquer dans cette zone de texte vos idées, réflexions, évolutions récentes, projets actuels, etc.",null,null,null,null,null,null,null,null,null,null,null,null,null,null,null,0]
[]
[]
[]
[]
[]
[]
[]
[]
[]
[]
[]
[null,null,null,null,null,null,null,null,null,null,null,null,null,null,null,null,null,null,null,null,null,null,{"$f":"Results!H49","v":"0/12"}]
[]
[]
[]
[]
[null,null,null,null,null,null,"Quelle est la situation actuelle dans votre pays en ce qui concerne Q7.1?"]
[null,null,null,"Q7.1 Dans quelle mesure les rôles et les responsabilités (liés aux objectifs de financement de la santé et au rendement en matière de collecte de recettes, de mise en commun, d’achats, de prestations, etc.) sont clairement définis et répartis entre les institutions responsables du financement de la santé ?",null,null,"Veuillez indiquer dans cette zone de texte vos idées, réflexions, évolutions récentes, projets actuels, etc.",null,null,null,null,null,null,null,null,null,null,null,null,null,null,null,0]
[]
[]
[]
[]
[]
[]
[]
[]
[]
[]
[]
[null,null,null,null,null,null,null,null,null,null,null,null,null,null,null,null,null,null,null,null,null,null,{"$f":"Results!H52","v":"0/12"}]
[]
[]
[null,null,null,null,null,null,"Quelle est la situation actuelle dans votre pays en ce qui concerne Q7.2?"]
[null,null,null,"Q7.2 Dans quelle mesure les institutions responsables du financement de la santé disposent-elles de capacités adéquates, notamment en matière de ressources humaines (capacités techniques et managériales) et de TIC ?",null,null,"Veuillez indiquer dans cette zone de texte vos idées, réflexions, évolutions récentes, projets actuels, etc.",null,null,null,null,null,null,null,null,null,null,null,null,null,null,null,0]
[]
[]
[]
[]
[]
[]
[]
[]
[]
[]
[]
[null,null,null,null,null,null,null,null,null,null,null,null,null,null,null,null,null,null,null,null,null,null,{"$f":"Results!H53","v":"0/12"}]
[]
[]
[null,null,null,null,null,null,"Quelle est la situation actuelle dans votre pays en ce qui concerne Q7.3?"]
[null,null,null,"Q7.3 Dans quelle mesure les mécanismes de responsabilisation des organismes d’achat/de financement (y compris l’autonomie et le conseil d’administration de l’agence d’assurance-maladie, les mécanismes de récompense/sanction, etc.) sont-ils en place pour s’assurer que la politique de financement de la santé appuie les progrès vers les objectifs du secteur et que les fonds sont utilisés efficacement pour les populations, programmes et services prioritaires ?",null,null,"Veuillez indiquer dans cette zone de texte vos idées, réflexions, évolutions récentes, projets actuels, etc.",null,null,null,null,null,null,null,null,null,null,null,null,null,null,null,0]
[]
[]
[]
[]
[]
[]
[]
[]
[]
[]
[]
[null,null,null,null,null,null,null,null,null,null,null,null,null,null,null,null,null,null,null,null,null,null,{"$f":"Results!H54","v":"0/12"}]
[]
[]
[null,null,null,null,null,null,"Quelle est la situation actuelle dans votre pays en ce qui concerne Q7.4?"]
[null,null,null,"Q7.4 L’utilisation des fonds ou les performances des institutions achetant des services auprès des prestataires de services de santé ou le budget de la santé ont-ils été communiqués au public (par ex. rapport annuel) ?",null,null,"Veuillez indiquer dans cette zone de texte vos idées, réflexions, évolutions récentes, projets actuels, etc.",null,null,null,null,null,null,null,null,null,null,null,null,null,null,null,0]
[]
[]
[]
[]
[]
[]
[]
[]
[]
[]
[]
[null,null,null,null,null,null,null,null,null,null,null,null,null,null,null,null,null,null,null,null,null,null,{"$f":"Results!H55","v":"0/12"}]
[]
[]
[null,null,null,null,null,null,"Quelle est la situation actuelle dans votre pays en ce qui concerne Q7.5?"]
[null,null,null,"Q7.5 Dans quelle mesure le Ministère des finances, le Ministère de la santé et l’organisme national d’assurance-maladie participent au processus d’élaboration des politiques de financement de la santé et en sont informés ?",null,null,"Veuillez indiquer dans cette zone de texte vos idées, réflexions, évolutions récentes, projets actuels, etc.",null,null,null,null,null,null,null,null,null,null,null,null,null,null,null,0]
[]
[]
[]
[]
[]
[]
[]
[]
[]
[]
[]
[null,null,null,null,null,null,null,null,null,null,null,null,null,null,null,null,null,null,null,null,null,null,{"$f":"Results!H56","v":"0/12"}]
[]
[]
[null,null,null,null,null,null,"Quelle est la situation actuelle dans votre pays en ce qui concerne Q7.6?"]
[null,null,null,"Q7.6 Dans quelle mesure le processus d’élaboration des politiques de financement de la santé est transparent et participatif?",null,null,"Veuillez indiquer dans cette zone de texte vos idées, réflexions, évolutions récentes, projets actuels, etc.",null,null,null,null,null,null,null,null,null,null,null,null,null,null,null,0]
[]
[]
[]
[]
[]
[]
[]
[]
[]
[]
[]
[null,null,null,null,null,null,null,null,null,null,null,null,null,null,null,null,null,null,null,null,null,null,{"$f":"Results!H57","v":"0/12"}]

{"sheet":"Equity_Fin","index":24,"n_rows":154,"n_cols":23,"rows_kept":154,"cut":false,"hidden":true,"merged":[[101,22,102,23],[119,22,120,23],[137,22,138,23],[153,22,154,23],[19,22,20,23],[35,22,36,23],[51,22,52,23],[67,22,68,23],[85,22,86,23],[7,3,20,4],[7,6,10,21],[14,6,18,8],[14,10,18,12],[14,14,18,15],[14,17,18,19],[55,3,68,4],[55,6,58,21],[62,10,66,12],[62,14,66,16],[23,3,36,4],[23,6,26,21],[30,17,34,19],[39,3,52,4],[39,6,42,21],[46,6,50,8],[46,10,50,12],[46,14,50,15],[46,17,50,19],[73,3,86,4],[73,6,76,21],[80,6,84,8],[80,10,84,12],[80,14,84,15],[80,17,84,19],[141,3,154,4],[141,6,144,21],[89,3,102,4],[89,6,92,21],[96,6,100,8],[96,10,100,12],[96,14,100,15],[96,17,100,19],[107,3,120,4],[107,6,110,21],[114,12,118,19],[125,3,138,4],[125,6,128,21]]}
[]
[]
[]
[]
[null,null,null,"Équité des financements",null,null,null,null,null,null,null," "]
[]
[null,null,null,null,null,null,"Quelle est la situation actuelle dans votre pays en ce qui concerne Q2.1?"]
[null,null,null,"Q2.1 Quelle approche est en vigueur dans votre pays en matière d’élaboration de politiques et de stratégies de collecte de revenus ? Cette approche s'inscrit-elle dans le cadre du processus global d’élaboration et de planification de la mise en œuvre des politiques de financement de la santé ?\n",null,null,"Veuillez indiquer dans cette zone de texte vos idées, réflexions, évolutions récentes, projets actuels, etc.",null,null,null,null,null,null,null,null,null,null,null,null,null,null,null,1]
[]
[]
[]
[]
[]
[]
[]
[]
[]
[]
[]
[null,null,null,null,null,null,null,null,null,null,null,null,null,null,null,null,null,null,null,null,null,null,{"$f":"Results!H12","v":"0/12"}]
[]
[]
[null,null,null,null,null,null,"Quelle est la situation actuelle dans votre pays en ce qui concerne Q2.2?"]
[null,null,null,"Q2.2 Dans quelle mesure le financement de la santé dans votre pays repose-t-il sur des sources de financement public/obligatoire (par exemple, fiscalité/recettes publiques, y compris les cotisations obligatoires à l’assurance-maladie nationale/sociale) ?\n",null,null,"Veuillez indiquer dans cette zone de texte vos idées, réflexions, évolutions récentes, projets actuels, etc.",null,null,null,null,null,null,null,null,null,null,null,null,null,null,null,0]
[]
[]
[]
[]
[]
[]
[]
[]
[]
[]
[]
[null,null,null,null,null,null,null,null,null,null,null,null,null,null,null,null,null,null,null,null,null,null,{"$f":"Results!H13","v":"0/12"}]
[]
[]
[null,null,null,null,null,null,"Quelle est la situation actuelle dans votre pays en ce qui concerne Q2.4?"]
[null,null,null,"Q2.4 Dans quelle mesure le flux de fonds publics est-il stable, notamment grâce à une exécution budgétaire régulière, c’est-à-dire un déblocage des fonds dans les délais, conformément aux budgets de santé approuvés ?\n",null,null,"Veuillez indiquer dans cette zone de texte vos idées, réflexions, évolutions récentes, projets actuels, etc.",null,null,null,null,null,null,null,null,null,null,null,null,null,null,null,0]
[]
[]
[]
[]
[]
[]
[]
[]
[]
[]
[]
[null,null,null,null,null,null,null,null,null,null,null,null,null,null,null,null,null,null,null,null,null,null,{"$f":"Results!H15","v":"0/12"}]
[]
[]
[null,null,null,null,null,null,"Quelle est la situation actuelle dans votre pays en ce qui concerne Q2.5?"]
[null,null,null,"Q2.5 Dans quelle mesure les différentes sources de revenus sont-elles collectées de façon progressive (c.-à-d. en fonction de la capacité de payer), et partant de là favorisent l’équité dans le mode de financement du système de santé ?\n",null,null,"Veuillez indiquer dans cette zone de texte vos idées, réflexions, évolutions récentes, projets actuels, etc.",null,null,null,null,null,null,null,null,null,null,null,null,null,null,null,0]
[]
[]
[]
[]
[]
[]
[]
[]
[]
[]
[]
[null,null,null,null,null,null,null,null,null,null,null,null,null,null,null,null,null,null,null,null,null,null,{"$f":"Results!H16","v":"0/12"}]
[]
[]
[]
[]
[null,null,null,null,null,null,"Quelle est la situation actuelle dans votre pays en ce qui concerne Q3.4?"]
[null,null,null,"Q3.4  Y-a-il des mesures, dans la conception des prestations, le paiement des prestataires ou les systèmes sous-jacents non financiers, qui visent à contrecarrer les problèmes découlant de la fragmentation de l’architecture du financement de la santé ?\n",null,null,"Veuillez indiquer dans cette zone de texte vos idées, réflexions, évolutions récentes, projets actuels, etc.",null,null,null,null,null,null,null,null,null,null,null,null,null,null,null,0]
[]
[]
[]
[]
[]
[]
[]
[]
[]
[]
[]
[null,null,null,null,null,null,null,null,null,null,null,null,null,null,null,null,null,null,null,null,null,null,{"$f":"Results!H20","v":"0/12"}]
[]
[]
[null,null,null,null,null,null,"Quelle est la situation actuelle dans votre pays en ce qui concerne Q3.6?"]
[null,null,null,"Q3.6 Dans quelle mesure les dispositifs d’assurance-maladie volontaire sont-ils une source d’inégalités, créant des effets de contagion potentiellement néfastes pour l’ensemble du système de santé ?\n",null,null,"Veuillez indiquer dans cette zone de texte vos idées, réflexions, évolutions récentes, projets actuels, etc.",null,null,null,null,null,null,null,null,null,null,null,null,null,null,null,0]
[]
[]
[]
[]
[]
[]
[]
[]
[]
[]
[]
[null,null,null,null,null,null,null,null,null,null,null,null,null,null,null,null,null,null,null,null,null,null,{"$f":"Results!H22","v":"0/12"}]
[]
[]
[]
[]
[null,null,null,null,null,null,"Quelle est la situation actuelle dans votre pays en ce qui concerne Q4.10?"]
[null,null,null,"Q4.10 Dans quelle mesure l’achat et le paiement des produits pharmaceutiques sont-ils mis en œuvre pour promouvoir l’utilisation efficace des médicaments (par exemple le recours aux génériques plutôt qu’aux princeps) et pour améliorer la protection financière des patients ?\n",null,null,"Veuillez indiquer dans cette zone de texte vos idées, réflexions, évolutions récentes, projets actuels, etc.",null,null,null,null,null,null,null,null,null,null,null,null,null,null,null,0]
[]
[]
[]
[]
[]
[]
[]
[]
[]
[]
[]
[null,null,null,null,null,null,null,null,null,null,null,null,null,null,null,null,null,null,null,null,null,null,{"$f":"Results!H33","v":"0/12"}]
[]
[]
[]
[]
[null,null,null,null,null,null,"Quelle est la situation actuelle dans votre pays en ce qui concerne Q5.4?"]
[null,null,null,"Q5.4 Dans quelle mesure les prestations accordent-elles la priorité aux catégories de population prioritaires, par exemple pour une meilleure utilisation des services hautement prioritaires et pour la protection financière ?\n",null,null,"Veuillez indiquer dans cette zone de texte vos idées, réflexions, évolutions récentes, projets actuels, etc.",null,null,null,null,null,null,null,null,null,null,null,null,null,null,null,0]
[]
[]
[]
[]
[]
[]
[]
[]
[]
[]
[]
[null,null,null,null,null,null,null,null,null,null,null,null,null,null,null,null,null,null,null,null,null,null,{"$f":"Results!H37","v":"0/12"}]
[]
[]
[null,null,null,null,null,null,"Quelle est la situation actuelle dans votre pays en ce qui concerne Q5.6?"]
[null,null,null,"Q5.6 Dans quelle mesure les prestations sont-elles alignées sur le paiement des prestataires, afin de s’assurer qu’elles sont fournies et que les patients bénéficient d’une protection financière ?\n",null,null,"Veuillez indiquer dans cette zone de texte vos idées, réflexions, évolutions récentes, projets actuels, etc.",null,null,null,null,null,null,null,null,null,null,null,null,null,null,null,0]
[]
[]
[]
[]
[]
[]
[]
[]
[]
[]
[]
[null,null,null,null,null,null,null,null,null,null,null,null,null,null,null,null,null,null,null,null,null,null,{"$f":"Results!H39","v":"0/12"}]

{"sheet":"Financial_prot","index":25,"n_rows":202,"n_cols":23,"rows_kept":202,"cut":false,"hidden":true,"merged":[[185,22,186,23],[201,22,202,23],[101,22,102,23],[117,22,118,23],[133,22,134,23],[149,22,150,23],[167,22,168,23],[19,22,20,23],[35,22,36,23],[51,22,52,23],[67,22,68,23],[85,22,86,23],[137,3,150,4],[137,6,140,21],[144,6,148,8],[144,10,148,12],[144,14,148,15],[144,17,148,19],[23,3,36,4],[23,6,26,21],[30,17,34,19],[7,3,20,4],[7,6,10,21],[14,6,18,8],[14,10,18,12],[14,14,18,15],[14,17,18,19],[39,3,52,4],[39,6,42,21],[46,6,50,8],[46,10,50,12],[46,14,50,15],[46,17,50,19],[55,3,68,4],[55,6,58,21],[62,10,66,12],[62,14,66,16],[73,3,86,4],[73,6,76,21],[80,6,84,8],[80,10,84,12],[80,14,84,15],[80,17,84,19],[89,3,102,4],[89,6,92,21],[96,6,100,8],[96,10,100,12],[96,14,100,15],[96,17,100,19],[105,3,118,4],[105,6,108,21],[112,6,116,8],[112,10,116,12],[112,14,116,15],[112,17,116,19],[121,3,134,4],[121,6,124,21],[128,6,132,8],[128,10,132,12],[128,14,132,15],[128,17,132,19],[189,3,202,4],[189,6,192,21],[173,3,186,4],[173,6,176,21],[155,3,168,4],[155,6,158,21],[162,12,166,19]]}
[]
[]
[]
[]
[null,null,null,"Protection financière ",null,null,null,null,null,null,null," "]
[]
[null,null,null,null,null,null,"Quelle est la situation actuelle dans votre pays en ce qui concerne Q2.1?"]
[null,null,null,"Q2.1 Quelle approche est en vigueur dans votre pays en matière d’élaboration de politiques et de stratégies de collecte de revenus ? Cette approche s'inscrit-elle dans le cadre du processus global d’élaboration et de planification de la mise en œuvre des politiques de financement de la santé ?\n",null,null,"Veuillez indiquer dans cette zone de texte vos idées, réflexions, évolutions récentes, projets actuels, etc.",null,null,null,null,null,null,null,null,null,null,null,null,null,null,null,1]
[]
[]
[]
[]
[]
[]
[]
[]
[]
[]
[]
[null,null,null,null,null,null,null,null,null,null,null,null,null,null,null,null,null,null,null,null,null,null,{"$f":"Results!H12","v":"0/12"}]
[]
[]
[null,null,null,null,null,null,"Quelle est la situation actuelle dans votre pays en ce qui concerne Q2.2?"]
[null,null,null,"Q2.2 Dans quelle mesure le financement de la santé dans votre pays repose-t-il sur des sources de financement public/obligatoire (par exemple, fiscalité/recettes publiques, y compris les cotisations obligatoires à l’assurance-maladie nationale/sociale) ?\n",null,null,"Veuillez indiquer dans cette zone de texte vos idées, réflexions, évolutions récentes, projets actuels, etc.",null,null,null,null,null,null,null,null,null,null,null,null,null,null,null,1]
[]
[]
[]
[]
[]
[]
[]
[]
[]
[]
[]
[null,null,null,null,null,null,null,null,null,null,null,null,null,null,null,null,null,null,null,null,null,null,{"$f":"Results!H13","v":"0/12"}]
[]
[]
[null,null,null,null,null,null,"Quelle est la situation actuelle dans votre pays en ce qui concerne Q2.4?"]
[null,null,null,"Q2.4 Dans quelle mesure le flux de fonds publics est-il stable, notamment grâce à une exécution budgétaire régulière, c’est-à-dire un déblocage des fonds dans les délais, conformément aux budgets de santé approuvés ?\n",null,null,"Veuillez indiquer dans cette zone de texte vos idées, réflexions, évolutions récentes, projets actuels, etc.",null,null,null,null,null,null,null,null,null,null,null,null,null,null,null,1]
[]
[]
[]
[]
[]
[]
[]
[]
[]
[]
[]
[null,null,null,null,null,null,null,null,null,null,null,null,null,null,null,null,null,null,null,null,null,null,{"$f":"Results!H15","v":"0/12"}]
[]
[]
[null,null,null,null,null,null,"Quelle est la situation actuelle dans votre pays en ce qui concerne Q2.5?"]
[null,null,null,"Q2.5 Dans quelle mesure les différentes sources de revenus sont-elles collectées de façon progressive (c.-à-d. en fonction de la capacité de payer), et partant de là favorisent l’équité dans le mode de financement du système de santé ?\n",null,null,"Veuillez indiquer dans cette zone de texte vos idées, réflexions, évolutions récentes, projets actuels, etc.",null,null,null,null,null,null,null,null,null,null,null,null,null,null,null,1]
[]
[]
[]
[]
[]
[]
[]
[]
[]
[]
[]
[null,null,null,null,null,null,null,null,null,null,null,null,null,null,null,null,null,null,null,null,null,null,{"$f":"Results!H16","v":"0/12"}]
[]
[]
[]
[]
[null,null,null,null,null,null,"Quelle est la situation actuelle dans votre pays en ce qui concerne Q3.2?"]
[null,null,null,"Q3.2 Dans le cadre du processus global d’élaboration et de planification de la mise en œuvre des politiques de financement de la santé, quelle est l’approche de votre pays en matière de dispositifs de mise en commun des ressources ?",null,null,"Veuillez indiquer dans cette zone de texte vos idées, réflexions, évolutions récentes, projets actuels, etc.",null,null,null,null,null,null,null,null,null,null,null,null,null,null,null,1]
[]
[]
[]
[]
[]
[]
[]
[]
[]
[]
[]
[null,null,null,null,null,null,null,null,null,null,null,null,null,null,null,null,null,null,null,null,null,null,{"$f":"Results!H18","v":"0/12"}]
[]
[]
[null,null,null,null,null,null,"Quelle est la situation actuelle dans votre pays en ce qui concerne Q3.3?"]
[null,null,null,"Q3.3 Dans quelle mesure la capacité de redistribution des fonds prépayés dans votre pays est-elle limitée par le cadre institutionnel du financement de la santé ?",null,null,"Veuillez indiquer dans cette zone de texte vos idées, réflexions, évolutions récentes, projets actuels, etc.",null,null,null,null,null,null,null,null,null,null,null,null,null,null,null,1]
[]
[]
[]
[]
[]
[]
[]
[]
[]
[]
[]
[null,null,null,null,null,null,null,null,null,null,null,null,null,null,null,null,null,null,null,null,null,null,{"$f":"Results!H19","v":"0/12"}]
[]
[]
[null,null,null,null,null,null,"Quelle est la situation actuelle dans votre pays en ce qui concerne Q3.4?"]
[null,null,null,"Q3.4  Y-a-il des mesures, dans la conception des prestations, le paiement des prestataires ou les systèmes sous-jacents non financiers, qui visent à contrecarrer les problèmes découlant de la fragmentation de l’architecture du financement de la santé ?\n",null,null,"Veuillez indiquer dans cette zone de texte vos idées, réflexions, évolutions récentes, projets actuels, etc.",null,null,null,null,null,null,null,null,null,null,null,null,null,null,null,1]
[]
[]
[]
[]
[]
[]
[]
[]
[]
[]
[]
[null,null,null,null,null,null,null,null,null,null,null,null,null,null,null,null,null,null,null,null,null,null,{"$f":"Results!H20","v":"0/12"}]
[]
[]
[null,null,null,null,null,null,"Quelle est la situation actuelle dans votre pays en ce qui concerne Q3.5?"]
[null,null,null,"Q3.5 Dans quelle mesure les différentes sources de recettes et de financement sont-elles organisées de manière complémentaire, afin de financer un paquet de prestations pour l’ensemble de la population ?\n",null,null,"Veuillez indiquer dans cette zone de texte vos idées, réflexions, évolutions récentes, projets actuels, etc.",null,null,null,null,null,null,null,null,null,null,null,null,null,null,null,1]
[]
[]
[]
[]
[]
[]
[]
[]
[]
[]
[]
[null,null,null,null,null,null,null,null,null,null,null,null,null,null,null,null,null,null,null,null,null,null,{"$f":"Results!H21","v":"0/12"}]
[]
[]
[null,null,null,null,null,null,"Quelle est la situation actuelle dans votre pays en ce qui concerne Q3.6?"]
[null,null,null,"Q3.6 Dans quelle mesure les dispositifs d’assurance-maladie volontaire sont-ils une source d’inégalités, créant des effets de contagion potentiellement néfastes pour l’ensemble du système de santé ?\n",null,null,"Veuillez indiquer dans cette zone de texte vos idées, réflexions, évolutions récentes, projets actuels, etc.",null,null,null,null,null,null,null,null,null,null,null,null,null,null,null,1]
[]
[]
[]
[]
[]
[]
[]
[]
[]
[]
[]
[null,null,null,null,null,null,null,null,null,null,null,null,null,null,null,null,null,null,null,null,null,null,{"$f":"Results!H22","v":"0/12"}]
[]
[]
[]
[]
[null,null,null,null,null,null,"Quelle est la situation actuelle dans votre pays en ce qui concerne Q4.10?"]
[null,null,null,"Q4.10 Dans quelle mesure l’achat et le paiement des produits pharmaceutiques sont-ils mis en œuvre pour promouvoir l’utilisation efficace des médicaments (par exemple le recours aux génériques plutôt qu’aux princeps) et pour améliorer la protection financière des patients ?\n",null,null,"Veuillez indiquer dans cette zone de texte vos idées, réflexions, évolutions récentes, projets actuels, etc.",null,null,null,null,null,null,null,null,null,null,null,null,null,null,null,1]
[]
[]
[]
[]
[]
[]
[]
[]
[]
[]
[]
[null,null,null,null,null,null,null,null,null,null,null,null,null,null,null,null,null,null,null,null,null,null,{"$f":"Results!H33","v":"0/12"}]
[]
[]
[]
[]
[null,null,null,null,null,null,"Quelle est la situation actuelle dans votre pays en ce qui concerne Q5.4?"]
[null,null,null,"Q5.4 Dans quelle mesure les prestations accordent-elles la priorité aux catégories de population prioritaires, par exemple pour une meilleure utilisation des services hautement prioritaires et pour la protection financière ?\n",null,null,"Veuillez indiquer dans cette zone de texte vos idées, réflexions, évolutions récentes, projets actuels, etc.",null,null,null,null,null,null,null,null,null,null,null,null,null,null,null,1]
[]
[]
[]
[]
[]
[]
[]
[]
[]
[]
[]
[null,null,null,null,null,null,null,null,null,null,null,null,null,null,null,null,null,null,null,null,null,null,{"$f":"Results!H37","v":"0/12"}]
[]
[]
[null,null,null,null,null,null,"Quelle est la situation actuelle dans votre pays en ce qui concerne Q5.6?"]
[null,null,null,"Q5.6 Dans quelle mesure les prestations sont-elles alignées sur le paiement des prestataires, afin de s’assurer qu’elles sont fournies et que les patients bénéficient d’une protection financière ?\n",null,null,"Veuillez indiquer dans cette zone de texte vos idées, réflexions, évolutions récentes, projets actuels, etc.",null,null,null,null,null,null,null,null,null,null,null,null,null,null,null,1]
[]
[]
[]
[]
[]
[]
[]
[]
[]
[]
[]
[null,null,null,null,null,null,null,null,null,null,null,null,null,null,null,null,null,null,null,null,null,null,{"$f":"Results!H39","v":"0/12"}]

{"sheet":"Quality","index":26,"n_rows":134,"n_cols":23,"rows_kept":134,"cut":false,"hidden":true,"merged":[[99,22,100,23],[115,22,116,23],[133,22,134,23],[19,22,20,23],[35,22,36,23],[51,22,52,23],[67,22,68,23],[83,22,84,23],[39,3,52,4],[39,6,42,21],[46,17,50,19],[7,3,20,4],[7,6,10,21],[23,3,36,4],[23,6,26,21],[121,3,134,4],[121,6,124,21],[103,3,116,4],[103,6,106,21],[55,3,68,4],[55,6,58,21],[71,3,84,4],[71,6,74,21],[87,3,100,4],[87,6,90,21],[62,6,65,8],[62,10,65,12],[62,14,65,16],[62,18,65,20]]}
[]
[]
[]
[]
[null,null,null,"Qualité",null,null,null,null,null,null,null," "]
[null," "]
[null,null,null,null,null,null,"Quelle est la situation actuelle dans votre pays en ce qui concerne Q4.2?"]
[null,null,null,"Q4.2 Dans quelle mesure les paiements des prestataires sont-ils harmonisés entre régimes/sources de revenus et entre secteurs public et privé, afin de garantir des incitations cohérentes aux prestataires ?\n",null,null,"Veuillez indiquer dans cette zone de texte vos idées, réflexions, évolutions récentes, projets actuels, etc.",null,null,null,null,null,null,null,null,null,null,null,null,null,null,null,1]
[]
[]
[]
[]
[]
[]
[]
[]
[]
[]
[]
[null,null,null,null,null,null,null,null,null,null,null,null,null,null,null,null,null,null,null,null,null,null,{"$f":"Results!H25","v":"0/12"}]
[]
[]
[null,null,null,null,null,null,"Quelle est la situation actuelle dans votre pays en ce qui concerne Q4.3?"]
[null,null,null,"Q4.3 Dans quelle mesure les méthodes de paiement des prestataires et les achats en général favorisent-ils la qualité des soins et la coordination des soins entre les spécialités et les différents niveaux de soins ?\n",null,null,"Veuillez indiquer dans cette zone de texte vos idées, réflexions, évolutions récentes, projets actuels, etc.",null,null,null,null,null,null,null,null,null,null,null,null,null,null,null,0]
[]
[]
[]
[]
[]
[]
[]
[]
[]
[]
[]
[null,null,null,null,null,null,null,null,null,null,null,null,null,null,null,null,null,null,null,null,null,null,{"$f":"Results!H26","v":"0/12"}]
[]
[]
[null,null,null,null,null,null,"Quelle est la situation actuelle dans votre pays en ce qui concerne Q4.4?"]
[null,null,null,"Q4.4 Dans quelle mesure les contrats d’achat précisent-ils des exigences en matière de qualité des soins, y compris la disponibilité et la pertinence des soins, puis vérifient-ils de façon régulière qu’elles sont bien respectées ?\n",null,null,"Veuillez indiquer dans cette zone de texte vos idées, réflexions, évolutions récentes, projets actuels, etc.",null,null,null,null,null,null,null,null,null,null,null,null,null,null,null,1]
[]
[]
[]
[]
[]
[]
[]
[]
[]
[]
[]
[null,null,null,null,null,null,null,null,null,null,null,null,null,null,null,null,null,null,null,null,null,null,{"$f":"Results!H27","v":"0/12"}]
[]
[]
[null,null,null,null,null,null,"Quelle est la situation actuelle dans votre pays en ce qui concerne Q4.6?"]
[null,null,null,"Q4.6 Dans quelle mesure les formulaires de consultation des patients sont-ils normalisés dans l'ensemble du système de santé et utilisés pour analyser et évaluer l'activité de l’ensemble des prestataires et de la population \n",null,null,"Veuillez indiquer dans cette zone de texte vos idées, réflexions, évolutions récentes, projets actuels, etc.",null,null,null,null,null,null,null,null,null,null,null,null,null,null,null,0]
[]
[]
[]
[]
[]
[]
[]
[]
[]
[]
[]
[null,null,null,null,null,null,null,null,null,null,null,null,null,null,null,null,null,null,null,null,null,null,{"$f":"Results!H29","v":"0/12"}]
[]
[]
[null,null,null,null,null,null,"Quelle est la situation actuelle dans votre pays en ce qui concerne Q4.7?"]
[null,null,null,"Q4.7 Dans quelle mesure les paiements des prestataires  couvrent  uniquement une partie ou l’ensemble des coûts totaux (y compris les salaires, les dépenses récurrentes, etc.) ?\n\n\n",null,null,"Veuillez indiquer dans cette zone de texte vos idées, réflexions, évolutions récentes, projets actuels, etc.",null,null,null,null,null,null,null,null,null,null,null,null,null,null,null,0]
[]
[]
[]
[]
[]
[]
[]
[]
[]
[]
[]
[null,null,null,null,null,null,null,null,null,null,null,null,null,null,null,null,null,null,null,null,null,null,{"$f":"Results!H30","v":"0/12"}]
[]
[]
[null,null,null,null,null,null,"Quelle est la situation actuelle dans votre pays en ce qui concerne Q4.8?"]
[null,null,null,"Q4.8 Dans quelle mesure les prestataires jouissent-ils d’une autonomie financière et sont-ils tenus responsables, dans une mesure réaliste et conforme à leurs capacités ?\n",null,null,"Veuillez indiquer dans cette zone de texte vos idées, réflexions, évolutions récentes, projets actuels, etc.",null,null,null,null,null,null,null,null,null,null,null,null,null,null,null,1]
[]
[]
[]
[]
[]
[]
[]
[]
[]
[]
[]
[null,null,null,null,null,null,null,null,null,null,null,null,null,null,null,null,null,null,null,null,null,null,{"$f":"Results!H31","v":"0/12"}]
[]
[]
[null,null,null,null,null,null,"Quelle est la situation actuelle dans votre pays en ce qui concerne Q4.9?"]
[null,null,null,"Q4.9 Dans quelle mesure l’accréditation des prestataires ou les contrats sélectifs sont-ils établis, fonctionnels et utilisés pour les achats ?\n",null,null,"Veuillez indiquer dans cette zone de texte vos idées, réflexions, évolutions récentes, projets actuels, etc.",null,null,null,null,null,null,null,null,null,null,null,null,null,null,null,1]
[]
[]
[]
[]
[]
[]
[]
[]
[]
[]
[]
[null,null,null,null,null,null,null,null,null,null,null,null,null,null,null,null,null,null,null,null,null,null,{"$f":"Results!H32","v":"0/12"}]
[]
[]
[]
[]
[null,null,null,null,null,null,"Quelle est la situation actuelle dans votre pays en ce qui concerne Q7.2?"]
[null,null,null,"Q7.2 Dans quelle mesure les institutions responsables du financement de la santé disposent-elles de capacités adéquates, notamment en matière de ressources humaines (capacités techniques et managériales) et de TIC ?",null,null,"Veuillez indiquer dans cette zone de texte vos idées, réflexions, évolutions récentes, projets actuels, etc.",null,null,null,null,null,null,null,null,null,null,null,null,null,null,null,1]
[]
[]
[]
[]
[]
[]
[]
[]
[]
[]
[]
[null,null,null,null,null,null,null,null,null,null,null,null,null,null,null,null,null,null,null,null,null,null,{"$f":"Results!H53","v":"0/12"}]

{"sheet":"Sheet1","index":27,"n_rows":0,"n_cols":0,"rows_kept":0,"cut":false,"hidden":true,"merged":[]}

{"sheet":"Print your results Full","index":28,"n_rows":617,"n_cols":34,"rows_kept":617,"cut":false,"hidden":true,"merged":[[583,23,583,24],[585,17,585,18],[585,19,585,20],[585,21,585,22],[585,23,585,24],[583,4,583,16],[584,4,584,16],[585,4,585,16],[586,4,586,16],[586,17,586,18],[584,17,584,18],[557,2,560,2],[562,2,564,2],[565,2,574,2],[576,2,582,2],[583,2,588,2],[587,17,587,18],[587,19,587,20],[587,4,587,16],[588,4,588,16],[583,17,583,18],[583,19,583,20],[576,4,576,16],[577,4,577,16],[578,4,578,16],[579,4,579,16],[580,4,580,16],[581,4,581,16],[582,4,582,16],[582,17,582,18],[582,19,582,20],[573,17,573,18],[573,19,573,20],[571,17,571,18],[571,19,571,20],[587,25,587,26],[587,27,587,28],[587,29,587,31],[588,17,588,18],[588,19,588,20],[588,21,588,22],[588,23,588,24],[588,25,588,26],[588,27,588,28],[588,29,588,31],[587,21,587,22],[587,23,587,24],[582,21,582,22],[582,23,582,24],[582,25,582,26],[582,27,582,28],[582,29,582,31],[586,19,586,20],[586,21,586,22],[586,23,586,24],[586,25,586,26],[586,27,586,28],[586,29,586,31],[583,25,583,26],[583,27,583,28],[583,29,583,31],[584,19,584,20],[584,21,584,22],[584,23,584,24],[584,25,584,26],[584,27,584,28],[584,29,584,31],[585,25,585,26],[585,27,585,28],[585,29,585,31],[583,21,583,22],[580,23,580,24],[580,25,580,26],[580,27,580,28],[580,29,580,31],[581,17,581,18],[581,19,581,20],[581,21,581,22],[581,23,581,24],[581,25,581,26],[581,27,581,28],[581,29,581,31],[580,21,580,22],[580,17,580,18],[580,19,580,20],[578,21,578,22],[578,23,578,24],[578,25,578,26],[578,27,578,28],[578,29,578,31],[579,17,579,18],[579,19,579,20],[579,21,579,22],[579,23,579,24],[579,25,579,26],[579,27,579,28],[579,29,579,31],[578,17,578,18],[578,19,578,20],[576,21,576,22],[576,23,576,24],[576,25,576,26],[576,27,576,28],[576,29,576,31],[577,17,577,18],[577,19,577,20],[577,21,577,22],[577,23,577,24],[577,25,577,26],[577,27,577,28],[577,29,577,31],[576,17,576,18],[576,19,576,20],[574,29,574,31],[575,3,575,16],[575,17,575,18],[575,19,575,20],[575,21,575,22],[575,23,575,24],[575,25,575,26],[575,27,575,28],[575,29,575,31],[574,4,574,16],[565,29,565,31],[566,29,566,31],[567,29,567,31],[568,29,568,31],[569,29,569,31],[570,29,570,31],[571,29,571,31],[572,29,572,31],[573,29,573,31],[573,21,573,22],[573,23,573,24],[573,25,573,26],[573,27,573,28],[574,17,574,18],[574,19,574,20],[574,21,574,22],[574,23,574,24],[574,25,574,26],[574,27,574,28],[571,21,571,22],[571,23,571,24],[571,25,571,26],[571,27,571,28],[572,17,572,18],[572,19,572,20],[572,21,572,22],[572,23,572,24],[572,25,572,26],[572,27,572,28],[569,17,569,18],[569,19,569,20],[569,21,569,22],[569,23,569,24],[569,25,569,26],[569,27,569,28],[570,17,570,18],[570,19,570,20],[570,21,570,22],[570,23,570,24],[570,25,570,26],[570,27,570,28],[565,17,565,18],[565,19,565,20],[565,21,565,22],[565,23,565,24],[565,25,565,26],[565,27,565,28],[566,17,566,18],[566,19,566,20],[566,21,566,22],[566,23,566,24],[566,25,566,26],[566,27,566,28],[567,17,567,18],[567,19,567,20],[567,21,567,22],[567,23,567,24],[567,25,567,26],[567,27,567,28],[568,17,568,18],[568,19,568,20],[568,21,568,22],[568,23,568,24],[568,25,568,26],[568,27,568,28],[565,4,565,16],[566,4,566,16],[567,4,567,16],[568,4,568,16],[569,4,569,16],[570,4,570,16],[571,4,571,16],[572,4,572,16],[573,4,573,16],[558,29,558,31],[559,29,559,31],[560,29,560,31],[562,29,562,31],[563,29,563,31],[564,29,564,31],[562,17,562,18],[562,19,562,20],[562,21,562,22],[562,23,562,24],[562,25,562,26],[562,27,562,28],[563,17,563,18],[563,19,563,20],[563,21,563,22],[563,23,563,24],[563,25,563,26],[561,17,561,18],[561,19,561,20],[561,21,561,22],[561,23,561,24],[561,25,561,26],[561,27,561,28],[562,4,562,16],[563,4,563,16],[564,4,564,16],[557,17,557,18],[557,19,557,20],[557,21,557,22],[557,23,557,24],[557,25,557,26],[557,27,557,28],[558,17,558,18],[558,19,558,20],[558,21,558,22],[558,23,558,24],[558,25,558,26],[558,27,558,28],[563,27,563,28],[559,17,559,18],[559,19,559,20],[564,17,564,18],[564,19,564,20],[564,21,564,22],[564,23,564,24],[564,25,564,26],[564,27,564,28],[491,10,493,31],[494,10,496,31],[497,10,499,31],[500,10,502,31],[506,3,508,3],[490,10,490,31],[497,3,499,3],[561,29,561,31],[561,3,561,16],[557,4,557,16],[558,4,558,16],[559,4,559,16],[560,4,560,16],[559,21,559,22],[559,23,559,24],[559,25,559,26],[559,27,559,28],[560,17,560,18],[560,19,560,20],[560,21,560,22],[560,23,560,24],[560,25,560,26],[560,27,560,28],[557,29,557,31],[555,25,555,26],[555,27,555,28],[552,21,552,22],[552,23,552,24],[552,25,552,26],[552,27,552,28],[553,19,553,20],[553,21,553,22],[553,23,553,24],[553,25,553,26],[553,27,553,28],[554,21,554,22],[554,23,554,24],[554,25,554,26],[554,27,554,28],[491,3,493,3],[494,3,496,3],[352,4,354,9],[551,29,551,31],[552,29,552,31],[553,29,553,31],[554,29,554,31],[555,29,555,31],[556,29,556,31],[551,3,551,16],[551,17,551,18],[551,19,551,20],[551,21,551,22],[551,23,551,24],[551,25,551,26],[551,27,551,28],[552,4,552,16],[552,17,552,18],[527,24,528,31],[529,8,530,15],[529,16,530,23],[529,24,530,31],[531,8,532,15],[531,16,532,23],[500,3,502,3],[503,3,505,3],[477,4,479,17],[480,4,482,17],[355,3,357,3],[358,3,360,3],[361,3,363,3],[364,3,366,3],[556,4,556,16],[355,4,357,9],[358,4,360,9],[361,4,363,9],[364,4,366,9],[367,4,369,9],[484,1,486,31],[471,4,473,17],[474,4,476,17],[463,18,463,31],[523,1,524,7],[523,8,524,15],[523,16,524,23],[523,24,524,31],[525,1,526,7],[355,10,357,31],[552,2,556,2],[527,16,528,23],[555,4,555,16],[555,19,555,20],[555,21,555,22],[555,23,555,24],[554,17,554,18],[555,17,555,18],[545,2,548,31],[543,2,543,31],[541,2,541,31],[527,8,528,15],[553,4,553,16],[553,17,553,18],[554,4,554,16],[556,17,556,18],[552,19,552,20],[554,19,554,20],[556,19,556,20],[556,21,556,22],[556,23,556,24],[556,25,556,26],[556,27,556,28],[531,24,532,31],[270,4,271,11],[282,3,283,3],[284,3,285,3],[286,12,287,31],[288,12,289,31],[269,12,269,31],[270,12,271,31],[272,12,273,31],[274,12,275,31],[276,12,277,31],[278,12,279,31],[280,12,281,31],[284,12,285,31],[282,12,283,31],[270,3,271,3],[272,3,273,3],[274,4,275,11],[276,4,277,11],[278,4,279,11],[280,4,281,11],[282,4,283,11],[284,4,285,11],[286,4,287,11],[288,4,289,11],[73,10,77,31],[78,10,82,31],[100,6,103,16],[104,6,107,16],[248,3,249,3],[250,3,251,3],[252,3,253,3],[254,4,255,19],[124,3,127,3],[128,3,131,3],[132,3,135,3],[124,4,127,9],[128,4,131,9],[132,4,135,9],[197,10,199,31],[200,10,202,31],[203,10,205,31],[206,10,208,31],[120,10,123,31],[124,10,127,31],[128,10,131,31],[116,2,135,2],[244,3,245,3],[246,3,247,3],[63,2,82,2],[63,3,67,3],[68,3,72,3],[73,3,77,3],[242,1,261,2],[242,3,243,3],[78,3,82,3],[116,3,119,3],[120,3,123,3],[50,4,54,5],[50,6,54,16],[56,1,58,31],[33,17,33,31],[35,2,54,3],[35,4,39,5],[35,6,39,16],[40,4,44,5],[62,10,62,31],[276,3,277,3],[278,3,279,3],[280,3,281,3],[274,3,275,3],[286,3,287,3],[0,12,0,15],[0,26,0,29],[0,2,0,11],[22,3,25,20],[19,3,20,6],[19,8,19,10],[20,8,20,10],[45,4,49,5],[45,6,49,16],[40,6,44,16],[25,22,27,31],[29,23,29,32],[248,4,249,19],[250,4,251,19],[252,4,253,19],[116,4,119,9],[120,4,123,9],[116,10,119,31],[115,10,115,31],[491,2,508,2],[491,4,493,9],[494,4,496,9],[497,4,499,9],[322,17,322,31],[288,3,289,3],[335,4,337,5],[332,6,334,16],[335,6,337,16],[338,6,340,16],[345,1,347,31],[324,2,343,3],[324,4,325,5],[326,4,328,5],[329,4,331,5],[332,4,334,5],[341,6,343,16],[500,4,502,9],[503,4,505,9],[506,4,508,9],[352,2,372,2],[370,4,372,9],[270,2,289,2],[272,4,273,11],[324,6,325,16],[326,6,328,16],[329,6,331,16],[465,1,482,2],[465,3,467,3],[468,3,470,3],[471,3,473,3],[474,3,476,3],[477,3,479,3],[480,3,482,3],[465,4,467,17],[468,4,470,17],[338,4,340,5],[341,4,343,5],[351,10,351,31],[352,10,354,31],[358,10,360,31],[361,10,363,31],[364,10,366,31],[367,10,369,31],[370,10,372,31],[352,3,354,3],[367,3,369,3],[370,3,372,3],[260,4,261,19],[240,20,240,31],[194,10,196,31],[209,10,211,31],[212,10,213,31],[164,17,164,31],[187,1,189,31],[166,2,185,3],[166,4,168,5],[178,4,180,5],[181,4,183,5],[184,4,185,5],[166,6,168,16],[169,6,171,16],[172,6,174,16],[175,6,177,16],[178,6,180,16],[254,3,255,3],[256,3,257,3],[258,4,259,19],[206,4,208,9],[209,4,211,9],[212,4,213,9],[256,4,257,19],[63,4,67,9],[68,4,72,9],[73,4,77,9],[78,4,82,9],[63,10,67,31],[68,10,72,31],[193,10,193,31],[86,17,86,31],[132,10,135,31],[181,6,183,16],[184,6,185,16],[172,4,174,5],[175,4,177,5],[169,4,171,5],[109,1,111,31],[88,2,107,3],[88,4,91,5],[92,4,95,5],[96,4,99,5],[100,4,103,5],[104,4,107,5],[88,6,91,16],[92,6,95,16],[96,6,99,16],[537,8,538,15],[537,16,538,23],[537,24,538,31],[527,1,528,7],[529,1,530,7],[531,1,532,7],[533,1,534,7],[535,1,536,7],[537,1,538,7],[533,8,534,15],[533,16,534,23],[533,24,534,31],[535,8,536,15],[535,16,536,23],[535,24,536,31],[525,8,526,15],[512,2,512,30],[503,10,505,31],[506,10,508,31],[263,1,265,31],[525,16,526,23],[525,24,526,31],[194,2,213,2],[194,3,196,3],[197,3,199,3],[200,3,202,3],[203,3,205,3],[206,3,208,3],[209,3,211,3],[212,3,213,3],[194,4,196,9],[197,4,199,9],[200,4,202,9],[258,3,259,3],[260,3,261,3],[242,4,243,19],[244,4,245,19],[246,4,247,19],[203,4,205,9]]}
[null,null,"FULL VERSION"]
[]
[]
[]
[]
[]
[]
[]
[]
[]
[]
[]
[]
[]
[]
[]
[]
[]
[null,null,null,"Completed by: ",null,null,null,{"$f":"'Print your results'!H19","v":""}]
[null,null,null,{"$f":"'Print your results'!D20:G21","v":"Période couverte :"},null,null,null,{"$f":"'Print your results'!H20","v":"De : "},{"$f":"'Print your results'!I20:K20","v":" - "}]
[null,null,null,null,null,null,null,{"$f":"'Print your results'!H21","v":"À : "},{"$f":"'Print your results'!I21:K21","v":" - "}]
[]
[null,null,null,"Acknowledgements: Thanks are due to those who contributed to the development of the matrices as part of the review meeting held in Geneva in May 2018. Financial support from the Republic of South Korea and the UK (DfID MCHSS) was used to support this work and is also gratefully acknowledged."]
[]
[]
[null,null,null,null,null,null,null,null,null,null,null,null,null,null,null,null,null,null,null,null,null,null,{"$f":"'Print your results'!W26:AF28","v":"Note: Version V2.2du Prototype, élaboré en Novembre 2018 par l'Organisation Mondiale de la Santé "}]
[]
[]
[]
[29,null,null,null,null,null,null,null,null,null,null,null,null,null,null,null,null,null,null,null,null,null,null,"© World Health Organization 2018"]
[34]
[]
[]
[null,null,null,null,null,null,null,null,null,null,null,null,null,null,null,null,null,"Your assessment"]
[]
[null,null,{"$f":"Results!B8","v":"Processus d’élaboration des politiques"},null,{"$f":"Results!C8","v":"Q1.1"},null,{"$f":"Results!D8","v":"Le système de financement de la santé de votre pays a-t-il récemment fait l’objet d’un diagnostic ou d’une évaluation approfondie qui examine son impact sur les performances du système de santé ainsi que les causes des problèmes de performance ?"}]
[]
[]
[]
[]
[null,null,null,null,{"$f":"Results!C9","v":"Q1.2"},null,{"$f":"Results!D9","v":"A-t-on transposé en textes de loi/décrets une déclaration de politique récente relative au financement de la santé ?"}]
[]
[]
[]
[]
[null,null,null,null,{"$f":"Results!C10","v":"Q1.3"},null,{"$f":"Results!D10","v":"Existe-t-il un système de suivi régulier du financement de la santé, et si oui les données sont-elles utilisées pour suivre les progrès effectués (par exemple sur les modèles de dépenses et la protection financière) et pour renforcer la reddition de comptes ?"}]
[]
[]
[]
[]
[null,null,null,null,{"$f":"Results!C11","v":"Q1.4"},null,{"$f":"Results!D11","v":"Les études d’évaluation sont-elles réalisées sur une base systématique pour mesurer les conséquences de la mise en œuvre de réformes spécifiques du financement sur les objectifs du système de santé et dans quelles mesure les résultats servent-ils à guider la conception et la révision des politiques de financement de la santé ?"}]
[]
[]
[]
[]
[null,"Actions"]
[null,{"$f":"Results!M8","v":""}]
[]
[60]
[65]
[]
[]
[null,null,null,null,null,null,null,null,null,null,"Your opinion "]
[null,null,{"$f":"C36","v":"Processus d’élaboration des politiques"},{"$f":"E36","v":"Q1.1"},{"$f":"G36","v":"Le système de financement de la santé de votre pays a-t-il récemment fait l’objet d’un diagnostic ou d’une évaluation approfondie qui examine son impact sur les performances du système de santé ainsi que les causes des problèmes de performance ?"},null,null,null,null,null,{"$f":"'Print Excel'!B176","v":""}]
[]
[]
[]
[]
[null,null,null,{"$f":"E41","v":"Q1.2"},{"$f":"G41","v":"A-t-on transposé en textes de loi/décrets une déclaration de politique récente relative au financement de la santé ?"},null,null,null,null,null,{"$f":"'Print Excel'!B181","v":""}]
[]
[]
[]
[]
[null,null,null,{"$f":"E46","v":"Q1.3"},{"$f":"G46","v":"Existe-t-il un système de suivi régulier du financement de la santé, et si oui les données sont-elles utilisées pour suivre les progrès effectués (par exemple sur les modèles de dépenses et la protection financière) et pour renforcer la reddition de comptes ?"},null,null,null,null,null,{"$f":"'Print Excel'!B186","v":""}]
[]
[]
[]
[]
[null,null,null,{"$f":"E51","v":"Q1.4"},{"$f":"G51","v":"Les études d’évaluation sont-elles réalisées sur une base systématique pour mesurer les conséquences de la mise en œuvre de réformes spécifiques du financement sur les objectifs du système de santé et dans quelles mesure les résultats servent-ils à guider la conception et la révision des politiques de financement de la santé ?"},null,null,null,null,null,{"$f":"'Print Excel'!B191","v":""}]
[]
[]
[]
[]
[]
[96]
[]
[null,null,null,null,null,null,null,null,null,null,null,null,null,null,null,null,null,"Your assessment"]
[]
[null,null,{"$f":"Results!B12","v":"Collecte de recettes\n"},null,{"$f":"Results!C12","v":"Q2.1"},null,{"$f":"Results!D12","v":"Quelle approche est en vigueur dans votre pays en matière d’élaboration de politiques et de stratégies de collecte de revenus ? Cette approche s'inscrit-elle dans le cadre du processus global d’élaboration et de planification de la mise en œuvre des politiques de financement de la santé ?"}]
[]
[]
[]
[null,null,null,null,{"$f":"Results!C13","v":"Q2.2"},null,{"$f":"Results!D13","v":"Dans quelle mesure le financement de la santé dans votre pays repose-t-il sur des sources de financement public/obligatoire (par exemple, fiscalité/recettes publiques, y compris les cotisations obligatoires à l’assurance-maladie nationale/sociale) ?"}]
[]
[]
[]
[null,null,null,null,{"$f":"Results!C14","v":"Q2.3"},null,{"$f":"Results!D14","v":"Dans quelle mesure le financement public de la santé dans votre pays est-il prédictible sur plusieurs années ?"}]
[]
[]
[]
[null,null,null,null,{"$f":"Results!C15","v":"Q2.4"},null,{"$f":"Results!D15","v":"Dans quelle mesure le flux de fonds publics est-il stable, notamment grâce à une exécution budgétaire régulière, c’est-à-dire un déblocage des fonds dans les délais, conformément aux budgets de santé approuvés ?"}]
[]
[]
[]
[null,null,null,null,{"$f":"Results!C16","v":"Q2.5"},null,{"$f":"Results!D16","v":"Dans quelle mesure les différentes sources de revenus sont-elles collectées de façon progressive (c.-à-d. en fonction de la capacité de payer), et partant de là favorisent l’équité dans le mode de financement du système de santé ?"}]
[]
[]
[]
[null,"Actions"]
[null,{"$f":"Results!M9","v":""}]
[]
[122]
[]
[127]
[]
[null,null,null,null,null,null,null,null,null,null,"Your opinion "]
[null,null,{"$f":"C89","v":"Collecte de recettes\n"},{"$f":"E89","v":"Q2.1"},{"$f":"G89","v":"Quelle approche est en vigueur dans votre pays en matière d’élaboration de politiques et de stratégies de collecte de revenus ? Cette approche s'inscrit-elle dans le cadre du processus global d’élaboration et de planification de la mise en œuvre des politiques de financement de la santé ?"},null,null,null,null,null,{"$f":"Te.5","v":""}]
[]
[]
[]
[null,null,null,{"$f":"E93","v":"Q2.2"},{"$f":"G93","v":"Dans quelle mesure le financement de la santé dans votre pays repose-t-il sur des sources de financement public/obligatoire (par exemple, fiscalité/recettes publiques, y compris les cotisations obligatoires à l’assurance-maladie nationale/sociale) ?"},null,null,null,null,null,{"$f":"Te.6","v":""}]
[]
[]
[]
[null,null,null,{"$f":"E97","v":"Q2.3"},{"$f":"G97","v":"Dans quelle mesure le financement public de la santé dans votre pays est-il prédictible sur plusieurs années ?"},null,null,null,null,null,{"$f":"Te.7","v":""}]
[]
[]
[]
[null,null,null,{"$f":"E101","v":"Q2.4"},{"$f":"G101","v":"Dans quelle mesure le flux de fonds publics est-il stable, notamment grâce à une exécution budgétaire régulière, c’est-à-dire un déblocage des fonds dans les délais, conformément aux budgets de santé approuvés ?"},null,null,null,null,null,{"$f":"Te.8","v":""}]
[]
[]
[]
[null,null,null,{"$f":"E105","v":"Q2.5"},{"$f":"G105","v":"Dans quelle mesure les différentes sources de revenus sont-elles collectées de façon progressive (c.-à-d. en fonction de la capacité de payer), et partant de là favorisent l’équité dans le mode de financement du système de santé ?"},null,null,null,null,null,{"$f":"Te.9","v":""}]
[]
[]
[]
[]
[158]
[]
[]
[]
[]
[]
[]
[]
[]
[]
[]
[]
[null,null,null,null,null,null,null,null,null,null,null,null,null,null,null,null,null,null,null,null,null,null,null,null,null,null,null,null,null,null,null,null,null," "]
[]
[]
[]
[]
[]
[]
[]
[]
[]
[]
[]
[]
[189]
[]
[null,null,null,null,null,null,null,null,null,null,null,null,null,null,null,null,null,"Your assessment"]
[]
[null,null,{"$f":"Results!B17","v":"Mise en commun des recettes"},null,{"$f":"Results!C17","v":"Q3.1"},null,{"$f":"Results!D17","v":"Cette question a été maintenant remplacé par l’étape 1 et le tableau de vue d’ensemble et ne constitue donc plus une question distincte. Merci de bien vous assurer que vous avez complété l’étape 1 car cela vous aidera à remplir les questions de cette section."}]
[]
[]
[null,null,null,null,{"$f":"Results!C18","v":"Q3.2"},null,{"$f":"Results!D18","v":"Dans le cadre du processus global d’élaboration et de planification de la mise en œuvre des politiques de financement de la santé, quelle est l’approche de votre pays en matière de dispositifs de mise en commun des ressources ?"}]
[]
[]
[null,null,null,null,{"$f":"Results!C19","v":"Q3.3"},null,{"$f":"Results!D19","v":"Dans quelle mesure la capacité de redistribution des fonds prépayés dans votre pays est-elle limitée par le cadre institutionnel du financement de la santé ?"}]
[]
[]
[null,null,null,null,{"$f":"Results!C20","v":"Q3.4"},null,{"$f":"Results!D20","v":"Y-a-il des mesures, dans la conception des prestations, le paiement des prestataires ou les systèmes sous-jacents non financiers, qui visent à contrecarrer les problèmes découlant de la fragmentation de l’architecture du financement de la santé ?"}]
[]
[]
[null,null,null,null,{"$f":"Results!C21","v":"Q3.5"},null,{"$f":"Results!D21","v":"Dans quelle mesure les différentes sources de revenus et de financement sont-elles organisées de manière complémentaire, afin de financer un paquet de prestations pour l’ensemble de la population ?"}]
[]
[]
[null,null,null,null,{"$f":"Results!C22","v":"Q3.6"},null,{"$f":"Results!D22","v":"Dans quelle mesure les dispositifs d’assurance-maladie volontaire sont-ils une source d’inégalités, créant des effets de contagion potentiellement néfastes pour l’ensemble du système de santé ?"}]
[]
[]
[null,null,null,null,{"$f":"Results!C23","v":"Q3.7"},null,{"$f":"Results!D23","v":"Dans quelle mesure les flux financiers sont-ils incohérents et redondants, et empêchent d’utiliser efficacement le budget public et les fonds des donateurs ?"}]
[]
[null,"Actions"]
[null,{"$f":"Results!M10","v":""}]
[]
[215]
[]
[220]
[]
[null,null,null,null,null,null,null,null,null,null,"Your opinion "]
[null,null,{"$f":"C167","v":"Mise en commun des recettes"},{"$f":"E167","v":"Q3.1"},{"$f":"G167","v":"Cette question a été maintenant remplacé par l’étape 1 et le tableau de vue d’ensemble et ne constitue donc plus une question distincte. Merci de bien vous assurer que vous avez complété l’étape 1 car cela vous aidera à remplir les questions de cette section."},null,null,null,null,null,{"$f":"Te.10","v":""}]
[]
[]
[null,null,null,{"$f":"E170","v":"Q3.2"},{"$f":"G170","v":"Dans le cadre du processus global d’élaboration et de planification de la mise en œuvre des politiques de financement de la santé, quelle est l’approche de votre pays en matière de dispositifs de mise en commun des ressources ?"},null,null,null,null,null,{"$f":"Te.11","v":""}]
[]
[]
[null,null,null,{"$f":"E173","v":"Q3.3"},{"$f":"G173","v":"Dans quelle mesure la capacité de redistribution des fonds prépayés dans votre pays est-elle limitée par le cadre institutionnel du financement de la santé ?"},null,null,null,null,null,{"$f":"Te.12","v":""}]
[]
[]
[null,null,null,{"$f":"E176","v":"Q3.4"},{"$f":"G176","v":"Y-a-il des mesures, dans la conception des prestations, le paiement des prestataires ou les systèmes sous-jacents non financiers, qui visent à contrecarrer les problèmes découlant de la fragmentation de l’architecture du financement de la santé ?"},null,null,null,null,null,{"$f":"Te.13","v":""}]
[]
[]
[null,null,null,{"$f":"E179","v":"Q3.5"},{"$f":"G179","v":"Dans quelle mesure les différentes sources de revenus et de financement sont-elles organisées de manière complémentaire, afin de financer un paquet de prestations pour l’ensemble de la population ?"},null,null,null,null,null,{"$f":"Te.14","v":""}]
[]
[]
[null,null,null,{"$f":"E182","v":"Q3.6"},{"$f":"G182","v":"Dans quelle mesure les dispositifs d’assurance-maladie volontaire sont-ils une source d’inégalités, créant des effets de contagion potentiellement néfastes pour l’ensemble du système de santé ?"},null,null,null,null,null,{"$f":"Te.15","v":""}]
[]
[]
[null,null,null,{"$f":"E185","v":"Q3.7"},{"$f":"G185","v":"Dans quelle mesure les flux financiers sont-ils incohérents et redondants, et empêchent d’utiliser efficacement le budget public et les fonds des donateurs ?"},null,null,null,null,null,{"$f":"Te.16","v":""}]
[]
[]
[251]
[]
[]
[]
[]
[]
[]
[]
[]
[]
[]
[]
[]
[]
[]
[]
[]
[]
[]
[]
[]
[]
[]
[282]
[]
[null,null,null,null,null,null,null,null,null,null,null,null,null,null,null,null,null,null,null,null,"Your assessment"]
[]
[null,{"$f":"Results!B24","v":"Achats et paiement des prestataires"},null,{"$f":"Results!C24","v":"Q4.1"},{"$f":"Results!D24","v":"Dans quelle mesure les allocations de fonds aux acheteurs de niveau inférieur, par exemple les administrations locales, et/ou les taux de paiement aux prestataires sont-ils le reflet des besoins de santé de la population ?"}]
[]
[null,null,null,{"$f":"Results!C25","v":"Q4.2"},{"$f":"Results!D25","v":"Dans quelle mesure les paiements des prestataires sont-ils harmonisés entre régimes/sources de revenus et entre secteurs public et privé, afin de garantir des incitations cohérentes aux prestataires ?"}]
[]
[null,null,null,{"$f":"Results!C26","v":"Q4.3"},{"$f":"Results!D26","v":"Dans quelle mesure les méthodes de paiement des prestataires et les achats en général favorisent-ils la qualité des soins et la coordination des soins entre les spécialités et les différents niveaux de soins ?"}]
[]
[null,null,null,{"$f":"Results!C27","v":"Q4.4"},{"$f":"Results!D27","v":"Dans quelle mesure les contrats d’achat précisent-ils des exigences en matière de qualité des soins, y compris la disponibilité et la pertinence des soins, puis vérifient-ils de façon régulière qu’elles sont bien respectées ?"}]
[]
[null,null,null,{"$f":"Results!C28","v":"Q4.5"},{"$f":"Results!D28","v":"Dans quelle mesure les méthodes de paiement des prestataires favorisent-elles l’efficacité de l’allocation des ressources, par exemple en réduisant la prestation excessive ou en augmentant celle insuffisante des services, et gèrent-elles la croissance des dépenses ?"}]
[]
[null,null,null,{"$f":"Results!C29","v":"Q4.6"},{"$f":"Results!D29","v":"Dans quelle mesure les formulaires de consultation des patients sont-ils normalisés dans l'ensemble du système de santé et utilisés pour analyser et évaluer l'activité de l’ensemble des prestataires et de la population "}]
[]
[null,null,null,{"$f":"Results!C30","v":"Q4.7"},{"$f":"Results!D30","v":"Dans quelle mesure les paiements des prestataires  couvrent  uniquement une partie ou l’ensemble des coûts totaux (y compris les salaires, les dépenses récurrentes, etc.) ?"}]
[]
[null,null,null,{"$f":"Results!C31","v":"Q4.8"},{"$f":"Results!D31","v":"Dans quelle mesure les prestataires jouissent-ils d’une autonomie financière et sont-ils tenus responsables, dans une mesure réaliste et conforme à leurs capacités ?"}]
[]
[null,null,null,{"$f":"Results!C32","v":"Q4.9"},{"$f":"Results!D32","v":"Dans quelle mesure l’accréditation des prestataires ou les contrats sélectifs sont-ils établis, fonctionnels et utilisés pour les achats ?"}]
[]
[null,null,null,{"$f":"Results!C33","v":"Q4.10"},{"$f":"Results!D33","v":"Dans quelle mesure l’achat et le paiement des produits pharmaceutiques sont-ils mis en œuvre pour promouvoir l’utilisation efficace des médicaments (par exemple le recours aux génériques plutôt qu’aux princeps) et pour améliorer la protection financière des patients ?"}]
[]
[null,"Actions"]
[null,{"$f":"Results!M11","v":""}]
[]
[308]
[]
[313]
[]
[null,null,null,null,null,null,null,null,null,null,null,null,"Your opinion "]
[null,null,{"$f":"B243","v":"Achats et paiement des prestataires"},{"$f":"D243","v":"Q4.1"},{"$f":"E243","v":"Dans quelle mesure les allocations de fonds aux acheteurs de niveau inférieur, par exemple les administrations locales, et/ou les taux de paiement aux prestataires sont-ils le reflet des besoins de santé de la population ?"},null,null,null,null,null,null,null,{"$f":"Te.17","v":""}]
[]
[null,null,null,{"$f":"D245","v":"Q4.2"},{"$f":"E245","v":"Dans quelle mesure les paiements des prestataires sont-ils harmonisés entre régimes/sources de revenus et entre secteurs public et privé, afin de garantir des incitations cohérentes aux prestataires ?"},null,null,null,null,null,null,null,{"$f":"Te.18","v":""}]
[]
[null,null,null,{"$f":"D247","v":"Q4.3"},{"$f":"E247","v":"Dans quelle mesure les méthodes de paiement des prestataires et les achats en général favorisent-ils la qualité des soins et la coordination des soins entre les spécialités et les différents niveaux de soins ?"},null,null,null,null,null,null,null,{"$f":"Te.19","v":""}]
[]
[null,null,null,{"$f":"D249","v":"Q4.4"},{"$f":"E249","v":"Dans quelle mesure les contrats d’achat précisent-ils des exigences en matière de qualité des soins, y compris la disponibilité et la pertinence des soins, puis vérifient-ils de façon régulière qu’elles sont bien respectées ?"},null,null,null,null,null,null,null,{"$f":"Te.20","v":""}]
[]
[null,null,null,{"$f":"D251","v":"Q4.5"},{"$f":"E251","v":"Dans quelle mesure les méthodes de paiement des prestataires favorisent-elles l’efficacité de l’allocation des ressources, par exemple en réduisant la prestation excessive ou en augmentant celle insuffisante des services, et gèrent-elles la croissance des dépenses ?"},null,null,null,null,null,null,null,{"$f":"Te.21","v":""}]
[]
[null,null,null,{"$f":"D253","v":"Q4.6"},{"$f":"E253","v":"Dans quelle mesure les formulaires de consultation des patients sont-ils normalisés dans l'ensemble du système de santé et utilisés pour analyser et évaluer l'activité de l’ensemble des prestataires et de la population "},null,null,null,null,null,null,null,{"$f":"Te.22","v":""}]
[]
[null,null,null,{"$f":"D255","v":"Q4.7"},{"$f":"E255","v":"Dans quelle mesure les paiements des prestataires  couvrent  uniquement une partie ou l’ensemble des coûts totaux (y compris les salaires, les dépenses récurrentes, etc.) ?"},null,null,null,null,null,null,null,{"$f":"Te.23","v":""}]
[]
[null,null,null,{"$f":"D257","v":"Q4.8"},{"$f":"E257","v":"Dans quelle mesure les prestataires jouissent-ils d’une autonomie financière et sont-ils tenus responsables, dans une mesure réaliste et conforme à leurs capacités ?"},null,null,null,null,null,null,null,{"$f":"Te.24","v":""}]
[]
[null,null,null,{"$f":"D259","v":"Q4.9"},{"$f":"E259","v":"Dans quelle mesure l’accréditation des prestataires ou les contrats sélectifs sont-ils établis, fonctionnels et utilisés pour les achats ?"},null,null,null,null,null,null,null,{"$f":"Te.25","v":""}]
[]
[null,null,null,{"$f":"D261","v":"Q4.10"},{"$f":"E261","v":"Dans quelle mesure l’achat et le paiement des produits pharmaceutiques sont-ils mis en œuvre pour promouvoir l’utilisation efficace des médicaments (par exemple le recours aux génériques plutôt qu’aux princeps) et pour améliorer la protection financière des patients ?"},null,null,null,null,null,null,null,{"$f":"Te.26","v":""}]
[]
[]
[344]
[]
[]
[]
[]
[]
[]
[]
[]
[]
[]
[]
[]
[]
[]
[]
[]
[]
[]
[]
[]
[]
[]
[]
[]
[]
[370]
[]
[]
[375]
[]
[null,null,null,null,null,null,null,null,null,null,null,null,null,null,null,null,null,"Your assessment"]
[]
[null,null,{"$f":"Results!B34","v":"Prestations et droits"},null,{"$f":"Results!C34","v":"Q5.1"},null,{"$f":"Results!D34","v":"Cette question a été maintenant remplacé par l’étape 1 et le tableau de vue d’ensemble et ne constitue donc plus une question distincte. Merci de bien vous assurer que vous avez complété l’étape 1 car cela vous aidera à remplir les questions de cette section."}]
[]
[null,null,null,null,{"$f":"Results!C35","v":"Q5.2"},null,{"$f":"Results!D35","v":"Dans quelle mesure les décisions et les révisions relatives aux prestations sont-elles prises de manière transparente, sur la base d’un processus clairement défini et de critères convenus, tels que le rapport coût-efficacité, la protection financière, l’impact budgétaire ?"}]
[]
[]
[null,null,null,null,{"$f":"Results!C36","v":"Q5.3"},null,{"$f":"Results!D36","v":"Dans quelle mesure les droits à prestation reflètent-ils explicitement les besoins de santé de la population ?"}]
[]
[]
[null,null,null,null,{"$f":"Results!C37","v":"Q5.4"},null,{"$f":"Results!D37","v":"Dans quelle mesure les prestations accordent-elles la priorité aux catégories de population prioritaires, par exemple pour une meilleure utilisation des services hautement prioritaires et pour la protection financière ?"}]
[]
[]
[null,null,null,null,{"$f":"Results!C38","v":"Q5.5"},null,{"$f":"Results!D38","v":"Dans quelle mesure les droits et obligations de la population sont-ils explicitement définis et compris par les intéressés ?"}]
[]
[]
[null,null,null,null,{"$f":"Results!C39","v":"Q5.6"},null,{"$f":"Results!D39","v":"Dans quelle mesure les prestations sont-elles alignées sur le paiement des prestataires, afin de s’assurer qu’elles sont fournies et que les patients bénéficient d’une protection financière ?"}]
[]
[]
[null,null,null,null,{"$f":"Results!C40","v":"Q5.7"},null,{"$f":"Results!D40","v":"Dans quelle mesure les prestations, y compris le partage des coûts pour les patients, sont-elles alignées sur les recettes, afin d’assurer un financement adéquat des droits à prestations approuvés ?"}]
[]
[]
[null,"Actions"]
[null,{"$f":"Results!M12","v":""}]
[]
[401]
[]
[406]
[]
[null,null,null,null,null,null,null,null,null,null,"Your opinion "]
[null,null,{"$f":"C325","v":"Prestations et droits"},{"$f":"E325","v":"Q5.1"},{"$f":"G325","v":"Cette question a été maintenant remplacé par l’étape 1 et le tableau de vue d’ensemble et ne constitue donc plus une question distincte. Merci de bien vous assurer que vous avez complété l’étape 1 car cela vous aidera à remplir les questions de cette section."},null,null,null,null,null,{"$f":"Te.27","v":""}]
[]
[]
[null,null,null,{"$f":"E327","v":"Q5.2"},{"$f":"G327","v":"Dans quelle mesure les décisions et les révisions relatives aux prestations sont-elles prises de manière transparente, sur la base d’un processus clairement défini et de critères convenus, tels que le rapport coût-efficacité, la protection financière, l’impact budgétaire ?"},null,null,null,null,null,{"$f":"Te.28","v":""}]
[]
[]
[null,null,null,{"$f":"E330","v":"Q5.3"},{"$f":"G330","v":"Dans quelle mesure les droits à prestation reflètent-ils explicitement les besoins de santé de la population ?"},null,null,null,null,null,{"$f":"Te.29","v":""}]
[]
[]
[null,null,null,{"$f":"E333","v":"Q5.4"},{"$f":"G333","v":"Dans quelle mesure les prestations accordent-elles la priorité aux catégories de population prioritaires, par exemple pour une meilleure utilisation des services hautement prioritaires et pour la protection financière ?"},null,null,null,null,null,{"$f":"Te.30","v":""}]
[]
[]
[null,null,null,{"$f":"E336","v":"Q5.5"},{"$f":"G336","v":"Dans quelle mesure les droits et obligations de la population sont-ils explicitement définis et compris par les intéressés ?"},null,null,null,null,null,{"$f":"Te.31","v":""}]
[]
[]
[null,null,null,{"$f":"E339","v":"Q5.6"},{"$f":"G339","v":"Dans quelle mesure les prestations sont-elles alignées sur le paiement des prestataires, afin de s’assurer qu’elles sont fournies et que les patients bénéficient d’une protection financière ?"},null,null,null,null,null,{"$f":"Te.32","v":""}]
[]
[]
[null,null,null,{"$f":"E342","v":"Q5.7"},{"$f":"G342","v":"Dans quelle mesure les prestations, y compris le partage des coûts pour les patients, sont-elles alignées sur les recettes, afin d’assurer un financement adéquat des droits à prestations approuvés ?"},null,null,null,null,null,{"$f":"Te.33","v":""}]
[]
[]
[]
[437]
[]
[]
[]
[]
[]
[]
[]
[]
[]
[]
[]
[]
[]
[]
[]
[]
[]
[]
[]
[]
[]
[]
[]
[]
[]
[463]
[]
[]
[468]
[]
[]
[]
[]
[]
[]
[]
[]
[]
[]
[]
[]
[]
[]
[]
[]
[]
[]
[]
[]
[]
[]
[]
[]
[]
[494]
[]
[]
[499]
[]
[]
[]
[]
[]
[]
[]
[]
[]
[]
[]
[]
[]
[]
[]
[]
[]
[]
[]
[]
[]
[]
[]
[]
[]
[525]
[]
[]
[530]
[]
[null,null,null,null,null,null,null,null,null,null,null,null,null,null,null,null,null,null,"Your assessment"]
[]
[null,{"$f":"Results!B52","v":"Gouvernance"},null,{"$f":"Results!C52","v":"Q7.1"},{"$f":"Results!D52","v":"Dans quelle mesure les rôles et les responsabilités (liés aux objectifs de financement de la santé et au rendement en matière de collecte de recettes, de mise en commun, d’achats, de prestations, etc.) sont clairement définis et répartis entre les institutions responsables du financement de la santé ?"}]
[]
[]
[null,null,null,{"$f":"Results!C53","v":"Q7.2"},{"$f":"Results!D53","v":"Dans quelle mesure les institutions responsables du financement de la santé disposent-elles de capacités adéquates, notamment en matière de ressources humaines (capacités techniques et managériales) et de TIC ?"}]
[]
[]
[null,null,null,{"$f":"Results!C54","v":"Q7.3"},{"$f":"Results!D54","v":"Dans quelle mesure les mécanismes de responsabilisation des organismes d’achat/de financement (y compris l’autonomie et le conseil d’administration de l’agence d’assurance-maladie, les mécanismes de récompense/sanction, etc.) sont-ils en place pour s’assurer que la politique de financement de la santé appuie les progrès vers les objectifs du secteur et que les fonds sont utilisés efficacement pour les populations, programmes et services prioritaires ?"}]
[]
[]
[null,null,null,{"$f":"Results!C55","v":"Q7.4"},{"$f":"Results!D55","v":"L’utilisation des fonds ou les performances des institutions achetant des services auprès des prestataires de services de santé ou le budget de la santé ont-ils été communiqués au public (par exemple sous forme de rapport annuel) ?"}]
[]
[]
[null,null,null,{"$f":"Results!C56","v":"Q7.5"},{"$f":"Results!D56","v":"Dans quelle mesure le Ministère des finances, le Ministère de la santé et l’organisme national d’assurance-maladie participent au processus d’élaboration des politiques de financement de la santé et en sont informés ?"}]
[]
[]
[null,null,null,{"$f":"Results!C57","v":"Q7.6"},{"$f":"Results!D57","v":"Dans quelle mesure le processus d’élaboration des politiques de financement de la santé est transparent et participatif?"}]
[]
[]
[null,"Actions"]
[null,{"$f":"Results!M14","v":""}]
[]
[556]
[]
[530]
[]
[null,null,null,null,null,null,null,null,null,null,"Your opinion "]
[null,null,{"$f":"B466","v":"Gouvernance"},{"$f":"D466","v":"Q7.1"},{"$f":"E466","v":"Dans quelle mesure les rôles et les responsabilités (liés aux objectifs de financement de la santé et au rendement en matière de collecte de recettes, de mise en commun, d’achats, de prestations, etc.) sont clairement définis et répartis entre les institutions responsables du financement de la santé ?"},null,null,null,null,null,{"$f":"Te.34","v":""}]
[]
[]
[null,null,null,{"$f":"D469","v":"Q7.2"},{"$f":"E469","v":"Dans quelle mesure les institutions responsables du financement de la santé disposent-elles de capacités adéquates, notamment en matière de ressources humaines (capacités techniques et managériales) et de TIC ?"},null,null,null,null,null,{"$f":"Te.35","v":""}]
[]
[]
[null,null,null,{"$f":"D472","v":"Q7.3"},{"$f":"E472","v":"Dans quelle mesure les mécanismes de responsabilisation des organismes d’achat/de financement (y compris l’autonomie et le conseil d’administration de l’agence d’assurance-maladie, les mécanismes de récompense/sanction, etc.) sont-ils en place pour s’assurer que la politique de financement de la santé appuie les progrès vers les objectifs du secteur et que les fonds sont utilisés efficacement pour les populations, programmes et services prioritaires ?"},null,null,null,null,null,{"$f":"Te.36","v":""}]
[]
[]
[null,null,null,{"$f":"D475","v":"Q7.4"},{"$f":"E475","v":"L’utilisation des fonds ou les performances des institutions achetant des services auprès des prestataires de services de santé ou le budget de la santé ont-ils été communiqués au public (par exemple sous forme de rapport annuel) ?"},null,null,null,null,null,{"$f":"Te.37","v":""}]
[]
[]
[null,null,null,{"$f":"D478","v":"Q7.5"},{"$f":"E478","v":"Dans quelle mesure le Ministère des finances, le Ministère de la santé et l’organisme national d’assurance-maladie participent au processus d’élaboration des politiques de financement de la santé et en sont informés ?"},null,null,null,null,null,{"$f":"Te.38","v":""}]
[]
[]
[null,null,null,{"$f":"D481","v":"Q7.6"},{"$f":"E481","v":"Dans quelle mesure le processus d’élaboration des politiques de financement de la santé est transparent et participatif?"},null,null,null,null,null,{"$f":"Te.39","v":""}]
[]
[]
[]
[530]
[]
[null,null,"OVERVIEW OF HEALTH COVERAGE SCHEMES IN YOUR COUNTRY – A TEMPLATE"]
[]
[]
[]
[]
[]
[]
[]
[]
[]
[]
[null,{"$f":"Etape_1_Resume!C5","v":"CRITERES"},null,null,null,null,null,null,{"$f":"Etape_1_Resume!D5","v":"SYSTÈME PUBLIC"},null,null,null,null,null,null,null,{"$f":"Etape_1_Resume!E5","v":"AUTRE DISPOSTIF DE COUVERTURE (Ajouter nom spéficique dans votre pays)"},null,null,null,null,null,null,null,{"$f":"Etape_1_Resume!F5","v":"AUTRE DISPOSTIF DE COUVERTURE (Ajouter nom spéficique dans votre pays)"}]
[]
[null,{"$f":"Etape_1_Resume!C6","v":"POPULATION CIBLE\nTous les citoyens sont-ils couverts ou un sous-groupe spécifique, par exemple moins de 5 ans, salariés?\n"},null,null,null,null,null,null,{"$f":"Results!B64","v":""},null,null,null,null,null,null,null,{"$f":"Results!C64","v":""},null,null,null,null,null,null,null,{"$f":"Results!D64","v":""}]
[]
[null,{"$f":"Etape_1_Resume!C7","v":"POPULATION COUVERTE / souscrite\nNombre réel relatif à la pop cible.\n"},null,null,null,null,null,null,{"$f":"Results!B65","v":""},null,null,null,null,null,null,null,{"$f":"Results!C65","v":""},null,null,null,null,null,null,null,{"$f":"Results!D65","v":""}]
[]
[null,{"$f":"Etape_1_Resume!C8","v":"BASE DE COUVERTURE / SOUSCRIPTION\nPar exemple. obligatoire, automatique, volontaire\n"},null,null,null,null,null,null,{"$f":"Results!B66","v":""},null,null,null,null,null,null,null,{"$f":"Results!C66","v":""},null,null,null,null,null,null,null,{"$f":"Results!D66","v":""}]
[]
[null,{"$f":"Etape_1_Resume!C9","v":"AVANTAGES / DROITS\nUne liste de services ou niveau de soins est-elle définie? Est-ce que les utilisateurs doivent faire des co-paiements?\n"},null,null,null,null,null,null,{"$f":"Results!B67","v":""},null,null,null,null,null,null,null,{"$f":"Results!C67","v":""},null,null,null,null,null,null,null,{"$f":"Results!D67","v":""}]
[]
[null,{"$f":"Etape_1_Resume!C10","v":"SOURCES DE REVENUS\nD'où vient l'argent? Allocations / transferts budgétaires; contributions prépayées.\n"},null,null,null,null,null,null,{"$f":"Results!B68","v":""},null,null,null,null,null,null,null,{"$f":"Results!C68","v":""},null,null,null,null,null,null,null,{"$f":"Results!D68","v":""}]
[]
[null,{"$f":"Etape_1_Resume!C11","v":"ACCORDS DE MISE EN COMMUN\nLe budget de la santé est-il alloué aux autorités régionales, existe-t-il un ou plusieurs fonds d '«assurance»?\n"},null,null,null,null,null,null,{"$f":"Results!B69","v":""},null,null,null,null,null,null,null,{"$f":"Results!C69","v":""},null,null,null,null,null,null,null,{"$f":"Results!D69","v":""}]
[]
[null,{"$f":"Etape_1_Resume!C12","v":"MODALITES D'ACHAT\nDécrivez les arrangements de gestion et de gouvernance?\n"},null,null,null,null,null,null,{"$f":"Results!B70","v":""},null,null,null,null,null,null,null,{"$f":"Results!C70","v":""},null,null,null,null,null,null,null,{"$f":"Results!D70","v":""}]
[]
[]
[530]
[null,null,{"$f":"Objectives!F3","v":"MATRICE DE PROGRÈS POUR LE FINANCEMENT DE LA SANTÉ"}]
[]
[null,null,{"$f":"Objectives!D4","v":"OBJECTIFS DU SYSTÈME DE SANTÉ"}]
[]
[null,null,{"$f":"Objectives!D6","v":"La plupart des problèmes abordés dans les questions de la matrice ont une influence sur les performances du système de santé ; par exemple, une utilisation accrue des recettes publiques devrait améliorer la protection financière. L’OMS fait correspondre chaque question aux objectifs et buts des systèmes de santé, et les revoit en permanence. Sur cette page, vous pouvez voir un résumé des résultats que vous avez obtenus par rapport à ces objectifs. Ainsi, par exemple, lorsque votre évaluation reflète une situation bien avancée, ou des progrès considérables, l’effet sur les performances du système de santé est supposé être plus marqué, et ce qui apparaît ci-dessous par une teinte bleue plus sombre."}]
[]
[]
[]
[]
[]
[null,null,null,{"$f":"Objectives!F10","v":"Questions"},null,null,null,null,null,null,null,null,null,null,null,null,null,{"$f":"Objectives!K10","v":"Efficience"},null,{"$f":"Objectives!L10","v":"Équité dans la distribution des ressources"},null,{"$f":"Objectives!M10","v":"Transparence et responsabilité"},null,{"$f":"Objectives!N10","v":"Équité des financements"},null,{"$f":"Objectives!O10","v":"Protection financière "},null,{"$f":"Objectives!P10","v":"Qualité"},null,{"$f":"Objectives!Q10","v":"Utilisation par rapport aux besoins"}]
[null,null,{"$f":"Objectives!D15","v":"Collecte de recettes"},{"$f":"Objectives!E15","v":"Q2.1"},{"$f":"Objectives!F15","v":"Quelle approche est en vigueur dans votre pays en matière d’élaboration de politiques et de stratégies de collecte de revenus ? Cette approche s'inscrit-elle dans le cadre du processus global d’élaboration et de planification de la mise en œuvre des politiques de financement de la santé ?"},null,null,null,null,null,null,null,null,null,null,null,null,{"$f":"Objectives!K15","v":0},null,{"$f":"Objectives!L15","v":0},null,{"$f":"Objectives!M15","v":0},null,{"$f":"Objectives!N15","v":0},null,{"$f":"Objectives!O15","v":0},null,{"$f":"Objectives!P15","v":0},null,{"$f":"Objectives!Q15","v":0}]
[null,null,null,{"$f":"Objectives!E16","v":"Q2.2"},{"$f":"Objectives!F16","v":"Dans quelle mesure le financement de la santé dans votre pays repose-t-il sur des sources de financement public/obligatoire (par exemple, fiscalité/recettes publiques, y compris les cotisations obligatoires à l’assurance-maladie nationale/sociale) ?"},null,null,null,null,null,null,null,null,null,null,null,null,{"$f":"Objectives!K16","v":0},null,{"$f":"Objectives!L16","v":0},null,{"$f":"Objectives!M16","v":0},null,{"$f":"Objectives!N16","v":0},null,{"$f":"Objectives!O16","v":0},null,{"$f":"Objectives!P16","v":0},null,{"$f":"Objectives!Q16","v":0}]
[null,null,null,{"$f":"Objectives!E17","v":"Q2.3"},{"$f":"Objectives!F17","v":"Dans quelle mesure le financement public de la santé dans votre pays est-il prédictible sur plusieurs années ?"},null,null,null,null,null,null,null,null,null,null,null,null,{"$f":"Objectives!K17","v":0},null,{"$f":"Objectives!L17","v":0},null,{"$f":"Objectives!M17","v":0},null,{"$f":"Objectives!N17","v":0},null,{"$f":"Objectives!O17","v":0},null,{"$f":"Objectives!P17","v":0},null,{"$f":"Objectives!Q17","v":0}]
[null,null,null,{"$f":"Objectives!E18","v":"Q2.4"},{"$f":"Objectives!F18","v":"Dans quelle mesure le flux de fonds publics est-il stable, notamment grâce à une exécution budgétaire régulière, c’est-à-dire un déblocage des fonds dans les délais, conformément aux budgets de santé approuvés ?"},null,null,null,null,null,null,null,null,null,null,null,null,{"$f":"Objectives!K18","v":0},null,{"$f":"Objectives!L18","v":0},null,{"$f":"Objectives!M18","v":0},null,{"$f":"Objectives!N18","v":0},null,{"$f":"Objectives!O18","v":0},null,{"$f":"Objectives!P18","v":0},null,{"$f":"Objectives!Q18","v":0}]
[null,null,null,{"$f":"Objectives!E19","v":"Q2.5"},{"$f":"Objectives!F19","v":"Dans quelle mesure les différentes sources de revenus sont-elles collectées de façon progressive (c.-à-d. en fonction de la capacité de payer), et partant de là favorisent l’équité dans le mode de financement du système de santé ?"},null,null,null,null,null,null,null,null,null,null,null,null,{"$f":"Objectives!K19","v":0},null,{"$f":"Objectives!L19","v":0},null,{"$f":"Objectives!M19","v":0},null,{"$f":"Objectives!N19","v":0},null,{"$f":"Objectives!O19","v":0},null,{"$f":"Objectives!P19","v":0},null,{"$f":"Objectives!Q19","v":0}]
[null,null,{"$f":"Objectives!D20","v":"Mise en commun des recettes"},{"$f":"Objectives!E20","v":"Q3.1"},{"$f":"Objectives!F20","v":"Cette question a été maintenant remplacé par l’étape 1 et le tableau de vue d’ensemble et ne constitue donc plus une question distincte. Merci de bien vous assurer que vous avez complété l’étape 1 car cela vous aidera à remplir les questions de cette section."},null,null,null,null,null,null,null,null,null,null,null,null,{"$f":"Objectives!K20","v":0},null,{"$f":"Objectives!L20","v":0},null,{"$f":"Objectives!M20","v":0},null,{"$f":"Objectives!N20","v":0},null,{"$f":"Objectives!O20","v":0},null,{"$f":"Objectives!P20","v":0},null,{"$f":"Objectives!Q20","v":0}]
[null,null,null,{"$f":"Objectives!E21","v":"Q3.2"},{"$f":"Objectives!F21","v":"Dans le cadre du processus global d’élaboration et de planification de la mise en œuvre des politiques de financement de la santé, quelle est l’approche de votre pays en matière de dispositifs de mise en commun des ressources ?"},null,null,null,null,null,null,null,null,null,null,null,null,{"$f":"Objectives!K21","v":0},null,{"$f":"Objectives!L21","v":0},null,{"$f":"Objectives!M21","v":0},null,{"$f":"Objectives!N21","v":0},null,{"$f":"Objectives!O21","v":0},null,{"$f":"Objectives!P21","v":0},null,{"$f":"Objectives!Q21","v":0}]
[null,null,null,{"$f":"Objectives!E22","v":"Q3.3"},{"$f":"Objectives!F22","v":"Dans quelle mesure la capacité de redistribution des fonds prépayés dans votre pays est-elle limitée par le cadre institutionnel du financement de la santé ?"},null,null,null,null,null,null,null,null,null,null,null,null,{"$f":"Objectives!K22","v":0},null,{"$f":"Objectives!L22","v":0},null,{"$f":"Objectives!M22","v":0},null,{"$f":"Objectives!N22","v":0},null,{"$f":"Objectives!O22","v":0},null,{"$f":"Objectives!P22","v":0},null,{"$f":"Objectives!Q22","v":0}]
[null,null,null,{"$f":"Objectives!E23","v":"Q3.4"},{"$f":"Objectives!F23","v":"Y-a-il des mesures, dans la conception des prestations, le paiement des prestataires ou les systèmes sous-jacents non financiers, qui visent à contrecarrer les problèmes découlant de la fragmentation de l’architecture du financement de la santé ?"},null,null,null,null,null,null,null,null,null,null,null,null,{"$f":"Objectives!K23","v":0},null,{"$f":"Objectives!L23","v":0},null,{"$f":"Objectives!M23","v":0},null,{"$f":"Objectives!N23","v":0},null,{"$f":"Objectives!O23","v":0},null,{"$f":"Objectives!P23","v":0},null,{"$f":"Objectives!Q23","v":0}]
[null,null,null,{"$f":"D552","v":"Questions"},null,null,null,null,null,null,null,null,null,null,null,null,null,{"$f":"R552","v":"Efficience"},null,{"$f":"T552","v":"Équité dans la distribution des ressources"},null,{"$f":"V552","v":"Transparence et responsabilité"},null,{"$f":"X552","v":"Équité des financements"},null,{"$f":"Z552","v":"Protection financière "},null,{"$f":"AB552","v":"Qualité"},null,{"$f":"AD552","v":"Utilisation par rapport aux besoins"}]
[null,null,{"$f":"C558","v":"Mise en commun des recettes"},{"$f":"Objectives!E24","v":"Q3.5"},{"$f":"Objectives!F24","v":"Dans quelle mesure les différentes sources de revenus et de financement sont-elles organisées de manière complémentaire, afin de financer un paquet de prestations pour l’ensemble de la population ?"},null,null,null,null,null,null,null,null,null,null,null,null,{"$f":"Objectives!K24","v":0},null,{"$f":"Objectives!L24","v":0},null,{"$f":"Objectives!M24","v":0},null,{"$f":"Objectives!N24","v":0},null,{"$f":"Objectives!O24","v":0},null,{"$f":"Objectives!P24","v":0},null,{"$f":"Objectives!Q24","v":0}]
[null,null,null,{"$f":"Objectives!E25","v":"Q3.6"},{"$f":"Objectives!F25","v":"Dans quelle mesure les dispositifs d’assurance-maladie volontaire sont-ils une source d’inégalités, créant des effets de contagion potentiellement néfastes pour l’ensemble du système de santé ?"},null,null,null,null,null,null,null,null,null,null,null,null,{"$f":"Objectives!K25","v":0},null,{"$f":"Objectives!L25","v":0},null,{"$f":"Objectives!M25","v":0},null,{"$f":"Objectives!N25","v":0},null,{"$f":"Objectives!O25","v":0},null,{"$f":"Objectives!P25","v":0},null,{"$f":"Objectives!Q25","v":0}]
[null,null,null,{"$f":"Objectives!E26","v":"Q3.7"},{"$f":"Objectives!F26","v":"Dans quelle mesure les flux financiers sont-ils incohérents et redondants, et empêchent d’utiliser efficacement le budget public et les fonds des donateurs ?"},null,null,null,null,null,null,null,null,null,null,null,null,{"$f":"Objectives!K26","v":0},null,{"$f":"Objectives!L26","v":0},null,{"$f":"Objectives!M26","v":0},null,{"$f":"Objectives!N26","v":0},null,{"$f":"Objectives!O26","v":0},null,{"$f":"Objectives!P26","v":0},null,{"$f":"Objectives!Q26","v":0}]
[null,null,{"$f":"Objectives!D27","v":"Achats et paiement des prestataires"},{"$f":"Objectives!E27","v":"Q4.1"},{"$f":"Objectives!F27","v":"Dans quelle mesure les allocations de fonds aux acheteurs de niveau inférieur, par exemple les administrations locales, et/ou les taux de paiement aux prestataires sont-ils le reflet des besoins de santé de la population ?"},null,null,null,null,null,null,null,null,null,null,null,null,{"$f":"Objectives!K27","v":0},null,{"$f":"Objectives!L27","v":0},null,{"$f":"Objectives!M27","v":0},null,{"$f":"Objectives!N27","v":0},null,{"$f":"Objectives!O27","v":0},null,{"$f":"Objectives!P27","v":0},null,{"$f":"Objectives!Q27","v":0}]
[null,null,null,{"$f":"Objectives!E28","v":"Q4.2"},{"$f":"Objectives!F28","v":"Dans quelle mesure les paiements des prestataires sont-ils harmonisés entre régimes/sources de revenus et entre secteurs public et privé, afin de garantir des incitations cohérentes aux prestataires ?"},null,null,null,null,null,null,null,null,null,null,null,null,{"$f":"Objectives!K28","v":0},null,{"$f":"Objectives!L28","v":0},null,{"$f":"Objectives!M28","v":0},null,{"$f":"Objectives!N28","v":0},null,{"$f":"Objectives!O28","v":0},null,{"$f":"Objectives!P28","v":0},null,{"$f":"Objectives!Q28","v":0}]
[null,null,null,{"$f":"Objectives!E29","v":"Q4.3"},{"$f":"Objectives!F29","v":"Dans quelle mesure les méthodes de paiement des prestataires et les achats en général favorisent-ils la qualité des soins et la coordination des soins entre les spécialités et les différents niveaux de soins ?"},null,null,null,null,null,null,null,null,null,null,null,null,{"$f":"Objectives!K29","v":0},null,{"$f":"Objectives!L29","v":0},null,{"$f":"Objectives!M29","v":0},null,{"$f":"Objectives!N29","v":0},null,{"$f":"Objectives!O29","v":0},null,{"$f":"Objectives!P29","v":0},null,{"$f":"Objectives!Q29","v":0}]
[null,null,null,{"$f":"Objectives!E30","v":"Q4.4"},{"$f":"Objectives!F30","v":"Dans quelle mesure les contrats d’achat précisent-ils des exigences en matière de qualité des soins, y compris la disponibilité et la pertinence des soins, puis vérifient-ils de façon régulière qu’elles sont bien respectées ?"},null,null,null,null,null,null,null,null,null,null,null,null,{"$f":"Objectives!K30","v":0},null,{"$f":"Objectives!L30","v":0},null,{"$f":"Objectives!M30","v":0},null,{"$f":"Objectives!N30","v":0},null,{"$f":"Objectives!O30","v":0},null,{"$f":"Objectives!P30","v":0},null,{"$f":"Objectives!Q30","v":0}]
[null,null,null,{"$f":"Objectives!E31","v":"Q4.5"},{"$f":"Objectives!F31","v":"Dans quelle mesure les méthodes de paiement des prestataires favorisent-elles l’efficacité de l’allocation des ressources, par exemple en réduisant la prestation excessive ou en augmentant celle insuffisante des services, et gèrent-elles la croissance des dépenses ?"},null,null,null,null,null,null,null,null,null,null,null,null,{"$f":"Objectives!K31","v":0},null,{"$f":"Objectives!L31","v":0},null,{"$f":"Objectives!M31","v":0},null,{"$f":"Objectives!N31","v":0},null,{"$f":"Objectives!O31","v":0},null,{"$f":"Objectives!P31","v":0},null,{"$f":"Objectives!Q31","v":0}]
[null,null,null,{"$f":"Objectives!E32","v":"Q4.6"},{"$f":"Objectives!F32","v":"Dans quelle mesure les formulaires de consultation des patients sont-ils normalisés dans l'ensemble du système de santé et utilisés pour analyser et évaluer l'activité de l’ensemble des prestataires et de la population "},null,null,null,null,null,null,null,null,null,null,null,null,{"$f":"Objectives!K32","v":0},null,{"$f":"Objectives!L32","v":0},null,{"$f":"Objectives!M32","v":0},null,{"$f":"Objectives!N32","v":0},null,{"$f":"Objectives!O32","v":0},null,{"$f":"Objectives!P32","v":0},null,{"$f":"Objectives!Q32","v":0}]
[null,null,null,{"$f":"Objectives!E33","v":"Q4.7"},{"$f":"Objectives!F33","v":"Dans quelle mesure les paiements des prestataires  couvrent  uniquement une partie ou l’ensemble des coûts totaux (y compris les salaires, les dépenses récurrentes, etc.) ?"},null,null,null,null,null,null,null,null,null,null,null,null,{"$f":"Objectives!K33","v":0},null,{"$f":"Objectives!L33","v":0},null,{"$f":"Objectives!M33","v":0},null,{"$f":"Objectives!N33","v":0},null,{"$f":"Objectives!O33","v":0},null,{"$f":"Objectives!P33","v":0},null,{"$f":"Objectives!Q33","v":0}]
[null,null,null,{"$f":"Objectives!E34","v":"Q4.8"},{"$f":"Objectives!F34","v":"Dans quelle mesure les prestataires jouissent-ils d’une autonomie financière et sont-ils tenus responsables, dans une mesure réaliste et conforme à leurs capacités ?"},null,null,null,null,null,null,null,null,null,null,null,null,{"$f":"Objectives!K34","v":0},null,{"$f":"Objectives!L34","v":0},null,{"$f":"Objectives!M34","v":0},null,{"$f":"Objectives!N34","v":0},null,{"$f":"Objectives!O34","v":0},null,{"$f":"Objectives!P34","v":0},null,{"$f":"Objectives!Q34","v":0}]
[null,null,null,{"$f":"Objectives!E35","v":"Q4.9"},{"$f":"Objectives!F35","v":"Dans quelle mesure l’accréditation des prestataires ou les contrats sélectifs sont-ils établis, fonctionnels et utilisés pour les achats ?"},null,null,null,null,null,null,null,null,null,null,null,null,{"$f":"Objectives!K35","v":0},null,{"$f":"Objectives!L35","v":0},null,{"$f":"Objectives!M35","v":0},null,{"$f":"Objectives!N35","v":0},null,{"$f":"Objectives!O35","v":0},null,{"$f":"Objectives!P35","v":0},null,{"$f":"Objectives!Q35","v":0}]
[null,null,null,{"$f":"Objectives!E36","v":"Q4.10"},{"$f":"Objectives!F36","v":"Dans quelle mesure l’achat et le paiement des produits pharmaceutiques sont-ils mis en œuvre pour promouvoir l’utilisation efficace des médicaments (par exemple le recours aux génériques plutôt qu’aux princeps) et pour améliorer la protection financière des patients ?"},null,null,null,null,null,null,null,null,null,null,null,null,{"$f":"Objectives!K36","v":0},null,{"$f":"Objectives!L36","v":0},null,{"$f":"Objectives!M36","v":0},null,{"$f":"Objectives!N36","v":0},null,{"$f":"Objectives!O36","v":0},null,{"$f":"Objectives!P36","v":0},null,{"$f":"Objectives!Q36","v":0}]
[null,null,null,{"$f":"D562","v":"Questions"},null,null,null,null,null,null,null,null,null,null,null,null,null,{"$f":"R562","v":"Efficience"},null,{"$f":"T562","v":"Équité dans la distribution des ressources"},null,{"$f":"V562","v":"Transparence et responsabilité"},null,{"$f":"X562","v":"Équité des financements"},null,{"$f":"Z562","v":"Protection financière "},null,{"$f":"AB562","v":"Qualité"},null,{"$f":"AD562","v":"Utilisation par rapport aux besoins"}]
[null,null,{"$f":"Objectives!D37","v":"Prestations et droits"},{"$f":"Objectives!E37","v":"Q5.1"},{"$f":"Objectives!F37","v":"Cette question a été maintenant remplacé par l’étape 1 et le tableau de vue d’ensemble et ne constitue donc plus une question distincte. Merci de bien vous assurer que vous avez complété l’étape 1 car cela vous aidera à remplir les questions de cette section."},null,null,null,null,null,null,null,null,null,null,null,null,{"$f":"Objectives!K37","v":0},null,{"$f":"Objectives!L37","v":0},null,{"$f":"Objectives!M37","v":0},null,{"$f":"Objectives!N37","v":0},null,{"$f":"Objectives!O37","v":0},null,{"$f":"Objectives!P37","v":0},null,{"$f":"Objectives!Q37","v":0}]
[null,null,null,{"$f":"Objectives!E38","v":"Q5.2"},{"$f":"Objectives!F38","v":"Dans quelle mesure les décisions et les révisions relatives aux prestations sont-elles prises de manière transparente, sur la base d’un processus clairement défini et de critères convenus, tels que le rapport coût-efficacité, la protection financière, l’impact budgétaire ?"},null,null,null,null,null,null,null,null,null,null,null,null,{"$f":"Objectives!K38","v":0},null,{"$f":"Objectives!L38","v":0},null,{"$f":"Objectives!M38","v":0},null,{"$f":"Objectives!N38","v":0},null,{"$f":"Objectives!O38","v":0},null,{"$f":"Objectives!P38","v":0},null,{"$f":"Objectives!Q38","v":0}]
[null,null,null,{"$f":"Objectives!E39","v":"Q5.3"},{"$f":"Objectives!F39","v":"Dans quelle mesure les droits à prestation reflètent-ils explicitement les besoins de santé de la population ?"},null,null,null,null,null,null,null,null,null,null,null,null,{"$f":"Objectives!K39","v":0},null,{"$f":"Objectives!L39","v":0},null,{"$f":"Objectives!M39","v":0},null,{"$f":"Objectives!N39","v":0},null,{"$f":"Objectives!O39","v":0},null,{"$f":"Objectives!P39","v":0},null,{"$f":"Objectives!Q39","v":0}]
[null,null,null,{"$f":"Objectives!E40","v":"Q5.4"},{"$f":"Objectives!F40","v":"Dans quelle mesure les prestations accordent-elles la priorité aux catégories de population prioritaires, par exemple pour une meilleure utilisation des services hautement prioritaires et pour la protection financière ?"},null,null,null,null,null,null,null,null,null,null,null,null,{"$f":"Objectives!K40","v":0},null,{"$f":"Objectives!L40","v":0},null,{"$f":"Objectives!M40","v":0},null,{"$f":"Objectives!N40","v":0},null,{"$f":"Objectives!O40","v":0},null,{"$f":"Objectives!P40","v":0},null,{"$f":"Objectives!Q40","v":0}]
[null,null,null,{"$f":"Objectives!E41","v":"Q5.5"},{"$f":"Objectives!F41","v":"Dans quelle mesure les droits et obligations de la population sont-ils explicitement définis et compris par les intéressés ?"},null,null,null,null,null,null,null,null,null,null,null,null,{"$f":"Objectives!K41","v":0},null,{"$f":"Objectives!L41","v":0},null,{"$f":"Objectives!M41","v":0},null,{"$f":"Objectives!N41","v":0},null,{"$f":"Objectives!O41","v":0},null,{"$f":"Objectives!P41","v":0},null,{"$f":"Objectives!Q41","v":0}]
[null,null,null,{"$f":"Objectives!E42","v":"Q5.6"},{"$f":"Objectives!F42","v":"Dans quelle mesure les prestations sont-elles alignées sur le paiement des prestataires, afin de s’assurer qu’elles sont fournies et que les patients bénéficient d’une protection financière ?"},null,null,null,null,null,null,null,null,null,null,null,null,{"$f":"Objectives!K42","v":0},null,{"$f":"Objectives!L42","v":0},null,{"$f":"Objectives!M42","v":0},null,{"$f":"Objectives!N42","v":0},null,{"$f":"Objectives!O42","v":0},null,{"$f":"Objectives!P42","v":0},null,{"$f":"Objectives!Q42","v":0}]
[null,null,null,{"$f":"Objectives!E43","v":"Q5.7"},{"$f":"Objectives!F43","v":"Dans quelle mesure les prestations, y compris le partage des coûts pour les patients, sont-elles alignées sur les recettes, afin d’assurer un financement adéquat des droits à prestations approuvés ?"},null,null,null,null,null,null,null,null,null,null,null,null,{"$f":"Objectives!K43","v":0},null,{"$f":"Objectives!L43","v":0},null,{"$f":"Objectives!M43","v":0},null,{"$f":"Objectives!N43","v":0},null,{"$f":"Objectives!O43","v":0},null,{"$f":"Objectives!P43","v":0},null,{"$f":"Objectives!Q43","v":0}]
[null,null,{"$f":"Objectives!D55","v":"Gouvernance"},{"$f":"Objectives!E55","v":"Q7.1"},{"$f":"Objectives!F55","v":"Dans quelle mesure les rôles et les responsabilités (liés aux objectifs de financement de la santé et au rendement en matière de collecte de recettes, de mise en commun, d’achats, de prestations, etc.) sont clairement définis et répartis entre les institutions responsables du financement de la santé ?"},null,null,null,null,null,null,null,null,null,null,null,null,{"$f":"Objectives!K55","v":0},null,{"$f":"Objectives!L55","v":0},null,{"$f":"Objectives!M55","v":0},null,{"$f":"Objectives!N55","v":0},null,{"$f":"Objectives!O55","v":0},null,{"$f":"Objectives!P55","v":0},null,{"$f":"Objectives!Q55","v":0}]
[null,null,null,{"$f":"Objectives!E56","v":"Q7.2"},{"$f":"Objectives!F56","v":"Dans quelle mesure les institutions responsables du financement de la santé disposent-elles de capacités adéquates, notamment en matière de ressources humaines (capacités techniques et managériales) et de TIC ?"},null,null,null,null,null,null,null,null,null,null,null,null,{"$f":"Objectives!K56","v":0},null,{"$f":"Objectives!L56","v":0},null,{"$f":"Objectives!M56","v":0},null,{"$f":"Objectives!N56","v":0},null,{"$f":"Objectives!O56","v":0},null,{"$f":"Objectives!P56","v":0},null,{"$f":"Objectives!Q56","v":0}]
[null,null,null,{"$f":"Objectives!E57","v":"Q7.3"},{"$f":"Objectives!F57","v":"Dans quelle mesure les mécanismes de responsabilisation des organismes d’achat/de financement (y compris l’autonomie et le conseil d’administration de l’agence d’assurance-maladie, les mécanismes de récompense/sanction, etc.) sont-ils en place pour s’assurer que la politique de financement de la santé appuie les progrès vers les objectifs du secteur et que les fonds sont utilisés efficacement pour les populations, programmes et services prioritaires ?"},null,null,null,null,null,null,null,null,null,null,null,null,{"$f":"Objectives!K57","v":0},null,{"$f":"Objectives!L57","v":0},null,{"$f":"Objectives!M57","v":0},null,{"$f":"Objectives!N57","v":0},null,{"$f":"Objectives!O57","v":0},null,{"$f":"Objectives!P57","v":0},null,{"$f":"Objectives!Q57","v":0}]
[null,null,null,{"$f":"Objectives!E58","v":"Q7.4"},{"$f":"Objectives!F58","v":"L’utilisation des fonds ou les performances des institutions achetant des services auprès des prestataires de services de santé ou le budget de la santé ont-ils été communiqués au public (par exemple sous forme de rapport annuel) ?"},null,null,null,null,null,null,null,null,null,null,null,null,{"$f":"Objectives!K58","v":0},null,{"$f":"Objectives!L58","v":0},null,{"$f":"Objectives!M58","v":0},null,{"$f":"Objectives!N58","v":0},null,{"$f":"Objectives!O58","v":0},null,{"$f":"Objectives!P58","v":0},null,{"$f":"Objectives!Q58","v":0}]
[null,null,null,{"$f":"Objectives!E59","v":"Q7.5"},{"$f":"Objectives!F59","v":"Dans quelle mesure le Ministère des finances, le Ministère de la santé et l’organisme national d’assurance-maladie participent au processus d’élaboration des politiques de financement de la santé et en sont informés ?"},null,null,null,null,null,null,null,null,null,null,null,null,{"$f":"Objectives!K59","v":0},null,{"$f":"Objectives!L59","v":0},null,{"$f":"Objectives!M59","v":0},null,{"$f":"Objectives!N59","v":0},null,{"$f":"Objectives!O59","v":0},null,{"$f":"Objectives!P59","v":0},null,{"$f":"Objectives!Q59","v":0}]
[null,null,null,{"$f":"Objectives!E60","v":"Q7.6"},{"$f":"Objectives!F60","v":"Dans quelle mesure le processus d’élaboration des politiques de financement de la santé est transparent et participatif?"},null,null,null,null,null,null,null,null,null,null,null,null,{"$f":"Objectives!K60","v":0},null,{"$f":"Objectives!L60","v":0},null,{"$f":"Objectives!M60","v":0},null,{"$f":"Objectives!N60","v":0},null,{"$f":"Objectives!O60","v":0},null,{"$f":"Objectives!P60","v":0},null,{"$f":"Objectives!Q60","v":0}]
[]
[]
[]
[]
[]
[]
[]
[]
[]
[]
[]
[]
[]
[]
[]
[]
[]
[]
[]
[]
[]
[]
[]
[]
[]
[]
[]
[556]

{"sheet":"Print your results","index":29,"n_rows":433,"n_cols":34,"rows_kept":433,"cut":false,"hidden":true,"merged":[[291,4,292,16],[293,4,294,16],[295,4,296,16],[297,4,298,16],[299,4,300,16],[301,4,302,16],[228,2,247,3],[228,4,229,5],[228,6,229,16],[230,4,232,5],[230,6,232,16],[233,4,235,5],[233,6,235,16],[236,4,238,5],[236,6,238,16],[331,3,333,3],[331,4,333,17],[335,1,337,31],[314,18,314,31],[316,1,333,2],[316,3,318,3],[316,4,318,17],[319,3,321,3],[319,4,321,17],[322,3,324,3],[322,4,324,17],[325,3,327,3],[325,4,327,17],[328,3,330,3],[328,4,330,17],[303,4,304,16],[305,4,306,16],[176,3,177,3],[176,4,177,19],[178,3,179,3],[178,4,179,19],[180,3,181,3],[180,4,181,19],[168,20,168,31],[191,1,193,31],[182,3,183,3],[182,4,183,19],[184,3,185,3],[184,4,185,19],[186,3,187,3],[186,4,187,19],[226,17,226,31],[249,1,251,31],[239,4,241,5],[239,6,241,16],[242,4,244,5],[242,6,244,16],[245,4,247,5],[245,6,247,16],[130,6,132,16],[133,4,135,5],[133,6,135,16],[174,4,175,19],[116,17,116,31],[170,1,189,2],[170,3,171,3],[170,4,171,19],[172,3,173,3],[172,4,173,19],[174,3,175,3],[188,3,189,3],[188,4,189,19],[139,1,141,31],[118,2,137,3],[118,4,120,5],[118,6,120,16],[121,4,123,5],[121,6,123,16],[124,4,126,5],[136,4,137,5],[136,6,137,16],[124,6,126,16],[127,4,129,5],[80,6,83,16],[85,1,87,31],[64,2,83,3],[64,4,67,5],[64,6,67,16],[68,4,71,5],[68,6,71,16],[72,4,75,5],[72,6,75,16],[76,4,79,5],[76,6,79,16],[80,4,83,5],[127,6,129,16],[130,4,132,5],[33,17,33,31],[0,2,0,11],[62,17,62,31],[56,1,58,31],[35,2,54,3],[35,4,39,5],[35,6,39,16],[40,4,44,5],[40,6,44,16],[45,4,49,5],[45,6,49,16],[50,4,54,5],[50,6,54,16],[25,22,27,31],[22,3,25,20],[19,8,19,10],[20,8,20,10],[19,12,19,13],[20,12,20,13],[19,3,20,6],[0,18,1,21],[0,23,1,27],[350,3,350,16],[350,17,350,18],[350,19,350,20],[350,21,350,22],[350,23,350,24],[350,25,350,26],[350,27,350,28],[283,17,283,31],[285,3,286,3],[287,3,288,3],[289,3,290,3],[291,3,292,3],[293,3,294,3],[295,3,296,3],[297,3,298,3],[299,3,300,3],[301,3,302,3],[303,3,304,3],[305,3,306,3],[285,4,286,16],[287,4,288,16],[289,4,290,16],[350,29,350,31],[340,2,340,31],[351,2,355,2],[351,4,351,16],[352,4,352,16],[353,4,353,16],[354,4,354,16],[355,4,355,16],[351,17,351,18],[351,19,351,20],[351,21,351,22],[353,17,353,18],[353,19,353,20],[353,21,353,22],[355,17,355,18],[355,19,355,20],[355,21,355,22],[351,23,351,24],[351,25,351,26],[351,27,351,28],[351,29,351,31],[352,17,352,18],[352,19,352,20],[352,21,352,22],[352,23,352,24],[352,25,352,26],[352,27,352,28],[352,29,352,31],[353,23,353,24],[353,25,353,26],[353,27,353,28],[353,29,353,31],[354,17,354,18],[354,19,354,20],[354,21,354,22],[354,23,354,24],[354,25,354,26],[354,27,354,28],[354,29,354,31],[355,23,355,24],[355,25,355,26],[355,27,355,28],[355,29,355,31],[356,2,359,2],[356,4,356,16],[357,4,357,16],[358,4,358,16],[359,4,359,16],[356,17,356,18],[356,19,356,20],[356,21,356,22],[356,23,356,24],[356,25,356,26],[356,27,356,28],[356,29,356,31],[357,17,357,18],[357,19,357,20],[357,21,357,22],[357,23,357,24],[357,25,357,26],[357,27,357,28],[357,29,357,31],[358,17,358,18],[358,19,358,20],[358,21,358,22],[358,23,358,24],[358,25,358,26],[358,27,358,28],[358,29,358,31],[359,17,359,18],[359,19,359,20],[359,21,359,22],[359,23,359,24],[359,25,359,26],[359,27,359,28],[359,29,359,31],[360,3,360,16],[360,17,360,18],[360,19,360,20],[360,21,360,22],[360,23,360,24],[360,25,360,26],[360,27,360,28],[360,29,360,31],[361,2,363,2],[361,17,361,18],[361,19,361,20],[361,21,361,22],[361,23,361,24],[361,25,361,26],[361,27,361,28],[361,29,361,31],[362,17,362,18],[362,19,362,20],[362,21,362,22],[362,23,362,24],[362,25,362,26],[362,27,362,28],[362,29,362,31],[363,17,363,18],[364,2,373,2],[361,4,361,16],[362,4,362,16],[363,4,363,16],[364,4,364,16],[365,4,365,16],[366,4,366,16],[367,4,367,16],[368,4,368,16],[369,4,369,16],[370,4,370,16],[371,4,371,16],[372,4,372,16],[373,4,373,16],[363,19,363,20],[363,21,363,22],[363,23,363,24],[363,25,363,26],[363,27,363,28],[363,29,363,31],[364,17,364,18],[364,19,364,20],[364,21,364,22],[364,23,364,24],[364,25,364,26],[364,27,364,28],[364,29,364,31],[365,17,365,18],[365,19,365,20],[365,21,365,22],[365,23,365,24],[365,25,365,26],[365,27,365,28],[365,29,365,31],[366,17,366,18],[366,19,366,20],[366,21,366,22],[366,23,366,24],[366,25,366,26],[366,27,366,28],[366,29,366,31],[367,17,367,18],[367,19,367,20],[367,21,367,22],[367,23,367,24],[367,25,367,26],[367,27,367,28],[367,29,367,31],[368,17,368,18],[368,19,368,20],[368,21,368,22],[368,23,368,24],[368,25,368,26],[368,27,368,28],[368,29,368,31],[369,17,369,18],[369,19,369,20],[369,21,369,22],[369,23,369,24],[369,25,369,26],[369,27,369,28],[369,29,369,31],[370,17,370,18],[370,19,370,20],[370,21,370,22],[370,23,370,24],[370,25,370,26],[370,27,370,28],[370,29,370,31],[371,17,371,18],[371,19,371,20],[371,21,371,22],[371,23,371,24],[371,25,371,26],[371,27,371,28],[371,29,371,31],[372,17,372,18],[372,19,372,20],[372,21,372,22],[372,23,372,24],[372,25,372,26],[372,27,372,28],[372,29,372,31],[373,17,373,18],[373,19,373,20],[373,21,373,22],[373,23,373,24],[373,25,373,26],[373,27,373,28],[373,29,373,31],[374,3,374,16],[374,17,374,18],[374,19,374,20],[374,21,374,22],[374,23,374,24],[374,25,374,26],[374,27,374,28],[374,29,374,31],[394,2,399,2],[375,4,375,16],[376,4,376,16],[377,4,377,16],[378,4,378,16],[379,4,379,16],[380,4,380,16],[381,4,381,16],[394,4,394,16],[395,4,395,16],[396,4,396,16],[397,4,397,16],[398,4,398,16],[399,4,399,16],[389,4,389,16],[390,4,390,16],[391,4,391,16],[392,4,392,16],[393,4,393,16],[388,3,388,16],[375,29,375,31],[376,17,376,18],[376,19,376,20],[376,21,376,22],[376,23,376,24],[376,25,376,26],[376,27,376,28],[376,29,376,31],[375,2,381,2],[377,29,377,31],[378,17,378,18],[378,19,378,20],[378,21,378,22],[378,23,378,24],[378,25,378,26],[378,27,378,28],[378,29,378,31],[377,17,377,18],[377,19,377,20],[377,21,377,22],[379,29,379,31],[380,17,380,18],[380,19,380,20],[380,21,380,22],[380,23,380,24],[380,25,380,26],[380,27,380,28],[380,29,380,31],[379,17,379,18],[379,19,379,20],[379,21,379,22],[381,29,381,31],[394,17,394,18],[394,19,394,20],[394,21,394,22],[394,23,394,24],[394,25,394,26],[394,27,394,28],[394,29,394,31],[384,23,384,24],[384,25,384,26],[384,27,384,28],[385,17,385,18],[385,19,385,20],[385,21,385,22],[385,23,385,24],[385,25,385,26],[385,27,385,28],[386,17,386,18],[384,21,384,22],[381,17,381,18],[381,19,381,20],[395,25,395,26],[395,27,395,28],[395,29,395,31],[396,17,396,18],[396,19,396,20],[396,21,396,22],[396,23,396,24],[396,25,396,26],[396,27,396,28],[396,29,396,31],[387,17,387,18],[387,19,387,20],[387,21,387,22],[387,23,387,24],[387,25,387,26],[387,27,387,28],[391,17,391,18],[391,19,391,20],[391,21,391,22],[391,23,391,24],[399,23,399,24],[399,25,399,26],[399,27,399,28],[399,29,399,31],[344,2,347,31],[342,2,342,31],[397,17,397,18],[397,19,397,20],[397,21,397,22],[397,23,397,24],[397,25,397,26],[397,27,397,28],[397,29,397,31],[398,17,398,18],[398,19,398,20],[398,21,398,22],[398,23,398,24],[398,25,398,26],[398,27,398,28],[398,29,398,31],[395,17,395,18],[395,19,395,20],[395,21,395,22],[395,23,395,24],[399,17,399,18],[399,19,399,20],[399,21,399,22],[308,1,310,31],[285,1,306,2],[382,4,382,16],[383,4,383,16],[384,4,384,16],[385,4,385,16],[386,4,386,16],[387,4,387,16],[382,17,382,18],[382,19,382,20],[382,21,382,22],[382,23,382,24],[382,25,382,26],[382,27,382,28],[383,17,383,18],[383,19,383,20],[383,21,383,22],[383,23,383,24],[383,25,383,26],[383,27,383,28],[384,17,384,18],[381,21,381,22],[384,19,384,20],[386,19,386,20],[386,21,386,22],[386,23,386,24],[386,25,386,26],[386,27,386,28],[381,23,381,24],[381,25,381,26],[381,27,381,28],[379,23,379,24],[379,25,379,26],[379,27,379,28],[377,23,377,24],[377,25,377,26],[377,27,377,28],[375,17,375,18],[375,19,375,20],[375,21,375,22],[375,23,375,24],[375,25,375,26],[375,27,375,28],[391,25,391,26],[391,27,391,28],[392,17,392,18],[392,19,392,20],[392,21,392,22],[392,23,392,24],[392,25,392,26],[392,27,392,28],[388,25,388,26],[388,27,388,28],[389,17,389,18],[389,19,389,20],[389,21,389,22],[389,23,389,24],[389,25,389,26],[389,27,389,28],[390,17,390,18],[388,23,388,24],[390,23,390,24],[390,19,390,20],[390,21,390,22],[388,21,388,22],[388,29,388,31],[382,2,387,2],[389,2,393,2],[393,17,393,18],[393,19,393,20],[393,21,393,22],[393,23,393,24],[393,25,393,26],[393,27,393,28],[382,29,382,31],[383,29,383,31],[384,29,384,31],[385,29,385,31],[386,29,386,31],[387,29,387,31],[389,29,389,31],[390,29,390,31],[391,29,391,31],[392,29,392,31],[393,29,393,31],[388,17,388,18],[388,19,388,20],[390,25,390,26],[390,27,390,28]]}
[1]
[]
[]
[]
[]
[]
[]
[]
[]
[]
[]
[]
[]
[]
[]
[]
[]
[]
[null,null,null,"Rempli par :",null,null,null,{"$f":"IF(Instructions!H21=\"\",\"\",Instructions!H21)","v":""}]
[null,null,null,{"$f":"Instructions!G26","v":"Période couverte :"},null,null,null,{"$f":"Instructions!H26","v":"De : "},{"$f":"Instructions!K26&\" - \"&Instructions!I26","v":" - "}]
[null,null,null,null,null,null,null,{"$f":"Instructions!H27","v":"À : "},{"$f":"Instructions!K27&\" - \"&Instructions!I27","v":" - "}]
[]
[null,null,null,"Remerciements: Nous tenons à remercier tous ceux qui ont contribué à l’élaboration des matrices de progrès dans le cadre d’une réunion d’examen qui s’est tenue à Genève en mai 2018. Ce travail a bénéficié du soutien financier de la République de Corée du Sud et du Royaume-Uni (don du DfID MCHSS), que nous tenons également à remercier vivement."]
[]
[]
[null,null,null,null,null,null,null,null,null,null,null,null,null,null,null,null,null,null,null,null,null,null,{"$f":"\"Note: \"&Menu!C4&\"du Prototype, élaboré en Novembre 2018 par l'Organisation Mondiale de la Santé \"","v":"Note: Version V2.2du Prototype, élaboré en Novembre 2018 par l'Organisation Mondiale de la Santé "}]
[]
[]
[]
[29,null,null,null,null,null,null,null,null,null,null,null,null,null,null,null,null,"© World Health Organization 2019. All rights reserved."]
[34]
[]
[]
[null,null,null,null,null,null,null,null,null,null,null,null,null,null,null,null,null,"Votre évaluation"]
[]
[null,null,{"$f":"Results!B8","v":"Processus d’élaboration des politiques"},null,{"$f":"Results!C8","v":"Q1.1"},null,{"$f":"Results!D8","v":"Le système de financement de la santé de votre pays a-t-il récemment fait l’objet d’un diagnostic ou d’une évaluation approfondie qui examine son impact sur les performances du système de santé ainsi que les causes des problèmes de performance ?"}]
[]
[]
[]
[]
[null,null,null,null,{"$f":"Results!C9","v":"Q1.2"},null,{"$f":"Results!D9","v":"A-t-on transposé en textes de loi/décrets une déclaration de politique récente relative au financement de la santé ?"}]
[]
[]
[]
[]
[null,null,null,null,{"$f":"Results!C10","v":"Q1.3"},null,{"$f":"Results!D10","v":"Existe-t-il un système de suivi régulier du financement de la santé, et si oui les données sont-elles utilisées pour suivre les progrès effectués (par exemple sur les modèles de dépenses et la protection financière) et pour renforcer la reddition de comptes ?"}]
[]
[]
[]
[]
[null,null,null,null,{"$f":"Results!C11","v":"Q1.4"},null,{"$f":"Results!D11","v":"Les études d’évaluation sont-elles réalisées sur une base systématique pour mesurer les conséquences de la mise en œuvre de réformes spécifiques du financement sur les objectifs du système de santé et dans quelles mesure les résultats servent-ils à guider la conception et la révision des politiques de financement de la santé ?"}]
[]
[]
[]
[]
[null,"Points d’action"]
[null,{"$f":"Results!M8","v":""}]
[]
[60]
[]
[96]
[]
[null,null,null,null,null,null,null,null,null,null,null,null,null,null,null,null,null,"Votre évaluation"]
[]
[null,null,{"$f":"'Print your results Full'!C89","v":"Collecte de recettes\n"},null,{"$f":"'Print your results Full'!E89","v":"Q2.1"},null,{"$f":"'Print your results Full'!G89","v":"Quelle approche est en vigueur dans votre pays en matière d’élaboration de politiques et de stratégies de collecte de revenus ? Cette approche s'inscrit-elle dans le cadre du processus global d’élaboration et de planification de la mise en œuvre des politiques de financement de la santé ?"}]
[]
[]
[]
[null,null,null,null,{"$f":"'Print your results Full'!E93","v":"Q2.2"},null,{"$f":"'Print your results Full'!G93","v":"Dans quelle mesure le financement de la santé dans votre pays repose-t-il sur des sources de financement public/obligatoire (par exemple, fiscalité/recettes publiques, y compris les cotisations obligatoires à l’assurance-maladie nationale/sociale) ?"}]
[]
[]
[]
[null,null,null,null,{"$f":"'Print your results Full'!E97","v":"Q2.3"},null,{"$f":"'Print your results Full'!G97","v":"Dans quelle mesure le financement public de la santé dans votre pays est-il prédictible sur plusieurs années ?"}]
[]
[]
[]
[null,null,null,null,{"$f":"'Print your results Full'!E101","v":"Q2.4"},null,{"$f":"'Print your results Full'!G101","v":"Dans quelle mesure le flux de fonds publics est-il stable, notamment grâce à une exécution budgétaire régulière, c’est-à-dire un déblocage des fonds dans les délais, conformément aux budgets de santé approuvés ?"}]
[]
[]
[]
[null,null,null,null,{"$f":"'Print your results Full'!E105","v":"Q2.5"},null,{"$f":"'Print your results Full'!G105","v":"Dans quelle mesure les différentes sources de revenus sont-elles collectées de façon progressive (c.-à-d. en fonction de la capacité de payer), et partant de là favorisent l’équité dans le mode de financement du système de santé ?"}]
[]
[]
[]
[null,"Points d’action"]
[null,{"$f":"'Print your results Full'!B110","v":""}]
[]
[122]
[]
[158]
[null,null,null,"CHECK THIS"]
[]
[]
[]
[]
[]
[]
[]
[]
[]
[]
[null,null,null,null,null,null,null,null,null,null,null,null,null,null,null,null,null,null,null,null,null,null,null,null,null,null,null,null,null,null,null,null,null," "]
[]
[]
[]
[]
[]
[]
[]
[]
[]
[]
[]
[]
[189]
[]
[null,null,null,null,null,null,null,null,null,null,null,null,null,null,null,null,null,"Votre évaluation"]
[]
[null,null,{"$f":"'Print your results Full'!C167","v":"Mise en commun des recettes"},null,{"$f":"'Print your results Full'!E167","v":"Q3.1"},null,{"$f":"'Print your results Full'!G167","v":"Cette question a été maintenant remplacé par l’étape 1 et le tableau de vue d’ensemble et ne constitue donc plus une question distincte. Merci de bien vous assurer que vous avez complété l’étape 1 car cela vous aidera à remplir les questions de cette section."}]
[]
[]
[null,null,null,null,{"$f":"'Print your results Full'!E170","v":"Q3.2"},null,{"$f":"'Print your results Full'!G170","v":"Dans le cadre du processus global d’élaboration et de planification de la mise en œuvre des politiques de financement de la santé, quelle est l’approche de votre pays en matière de dispositifs de mise en commun des ressources ?"}]
[]
[]
[null,null,null,null,{"$f":"'Print your results Full'!E173","v":"Q3.3"},null,{"$f":"'Print your results Full'!G173","v":"Dans quelle mesure la capacité de redistribution des fonds prépayés dans votre pays est-elle limitée par le cadre institutionnel du financement de la santé ?"}]
[]
[]
[null,null,null,null,{"$f":"'Print your results Full'!E176","v":"Q3.4"},null,{"$f":"'Print your results Full'!G176","v":"Y-a-il des mesures, dans la conception des prestations, le paiement des prestataires ou les systèmes sous-jacents non financiers, qui visent à contrecarrer les problèmes découlant de la fragmentation de l’architecture du financement de la santé ?"}]
[]
[]
[null,null,null,null,{"$f":"'Print your results Full'!E179","v":"Q3.5"},null,{"$f":"'Print your results Full'!G179","v":"Dans quelle mesure les différentes sources de revenus et de financement sont-elles organisées de manière complémentaire, afin de financer un paquet de prestations pour l’ensemble de la population ?"}]
[]
[]
[null,null,null,null,{"$f":"'Print your results Full'!E182","v":"Q3.6"},null,{"$f":"'Print your results Full'!G182","v":"Dans quelle mesure les dispositifs d’assurance-maladie volontaire sont-ils une source d’inégalités, créant des effets de contagion potentiellement néfastes pour l’ensemble du système de santé ?"}]
[]
[]
[null,null,null,null,{"$f":"'Print your results Full'!E185","v":"Q3.7"},null,{"$f":"'Print your results Full'!G185","v":"Dans quelle mesure les flux financiers sont-ils incohérents et redondants, et empêchent d’utiliser efficacement le budget public et les fonds des donateurs ?"}]
[]
[null,"Points d’action"]
[null,{"$f":"'Print your results Full'!B188","v":""}]
[]
[215]
[]
[251]
[null,null,null,"CHECK THIS PART"]
[]
[]
[]
[]
[]
[]
[]
[]
[]
[]
[]
[]
[]
[]
[]
[]
[]
[]
[]
[]
[]
[282]
[]
[null,null,null,null,null,null,null,null,null,null,null,null,null,null,null,null,null,null,null,null,"Votre évaluation"]
[]
[null,{"$f":"'Print your results Full'!B243","v":"Achats et paiement des prestataires"},null,{"$f":"'Print your results Full'!D243","v":"Q4.1"},{"$f":"'Print your results Full'!E243","v":"Dans quelle mesure les allocations de fonds aux acheteurs de niveau inférieur, par exemple les administrations locales, et/ou les taux de paiement aux prestataires sont-ils le reflet des besoins de santé de la population ?"}]
[]
[null,null,null,{"$f":"'Print your results Full'!D245","v":"Q4.2"},{"$f":"'Print your results Full'!E245","v":"Dans quelle mesure les paiements des prestataires sont-ils harmonisés entre régimes/sources de revenus et entre secteurs public et privé, afin de garantir des incitations cohérentes aux prestataires ?"}]
[]
[null,null,null,{"$f":"'Print your results Full'!D247","v":"Q4.3"},{"$f":"'Print your results Full'!E247","v":"Dans quelle mesure les méthodes de paiement des prestataires et les achats en général favorisent-ils la qualité des soins et la coordination des soins entre les spécialités et les différents niveaux de soins ?"}]
[]
[null,null,null,{"$f":"'Print your results Full'!D249","v":"Q4.4"},{"$f":"'Print your results Full'!E249","v":"Dans quelle mesure les contrats d’achat précisent-ils des exigences en matière de qualité des soins, y compris la disponibilité et la pertinence des soins, puis vérifient-ils de façon régulière qu’elles sont bien respectées ?"}]
[]
[null,null,null,{"$f":"'Print your results Full'!D251","v":"Q4.5"},{"$f":"'Print your results Full'!E251","v":"Dans quelle mesure les méthodes de paiement des prestataires favorisent-elles l’efficacité de l’allocation des ressources, par exemple en réduisant la prestation excessive ou en augmentant celle insuffisante des services, et gèrent-elles la croissance des dépenses ?"}]
[]
[null,null,null,{"$f":"'Print your results Full'!D253","v":"Q4.6"},{"$f":"'Print your results Full'!E253","v":"Dans quelle mesure les formulaires de consultation des patients sont-ils normalisés dans l'ensemble du système de santé et utilisés pour analyser et évaluer l'activité de l’ensemble des prestataires et de la population "}]
[]
[null,null,null,{"$f":"'Print your results Full'!D255","v":"Q4.7"},{"$f":"'Print your results Full'!E255","v":"Dans quelle mesure les paiements des prestataires  couvrent  uniquement une partie ou l’ensemble des coûts totaux (y compris les salaires, les dépenses récurrentes, etc.) ?"}]
[]
[null,null,null,{"$f":"'Print your results Full'!D257","v":"Q4.8"},{"$f":"'Print your results Full'!E257","v":"Dans quelle mesure les prestataires jouissent-ils d’une autonomie financière et sont-ils tenus responsables, dans une mesure réaliste et conforme à leurs capacités ?"}]
[]
[null,null,null,{"$f":"'Print your results Full'!D259","v":"Q4.9"},{"$f":"'Print your results Full'!E259","v":"Dans quelle mesure l’accréditation des prestataires ou les contrats sélectifs sont-ils établis, fonctionnels et utilisés pour les achats ?"}]
[]
[null,null,null,{"$f":"'Print your results Full'!D261","v":"Q4.10"},{"$f":"'Print your results Full'!E261","v":"Dans quelle mesure l’achat et le paiement des produits pharmaceutiques sont-ils mis en œuvre pour promouvoir l’utilisation efficace des médicaments (par exemple le recours aux génériques plutôt qu’aux princeps) et pour améliorer la protection financière des patients ?"}]
[]
[null,"Points d’action"]
[null,{"$f":"'Print your results Full'!B264","v":""}]
[]
[308]
[]
[344]
[]
[]
[]
[]
[]
[null,null,null,null,null,null,null,null,null,null,null,null,null,null,null,null,null,null,null,null,null,null,null,null,null,null,null,null,"CHECK THIS PART"]
[]
[]
[]
[]
[]
[]
[]
[]
[]
[]
[]
[]
[]
[]
[]
[]
[]
[]
[]
[370]
[]
[]
[375]
[]
[null,null,null,null,null,null,null,null,null,null,null,null,null,null,null,null,null,"Votre évaluation"]
[]
[null,null,{"$f":"'Print your results Full'!C325","v":"Prestations et droits"},null,{"$f":"'Print your results Full'!E325","v":"Q5.1"},null,{"$f":"'Print your results Full'!G325","v":"Cette question a été maintenant remplacé par l’étape 1 et le tableau de vue d’ensemble et ne constitue donc plus une question distincte. Merci de bien vous assurer que vous avez complété l’étape 1 car cela vous aidera à remplir les questions de cette section."}]
[]
[null,null,null,null,{"$f":"'Print your results Full'!E327","v":"Q5.2"},null,{"$f":"'Print your results Full'!G327","v":"Dans quelle mesure les décisions et les révisions relatives aux prestations sont-elles prises de manière transparente, sur la base d’un processus clairement défini et de critères convenus, tels que le rapport coût-efficacité, la protection financière, l’impact budgétaire ?"}]
[]
[]
[null,null,null,null,{"$f":"'Print your results Full'!E330","v":"Q5.3"},null,{"$f":"'Print your results Full'!G330","v":"Dans quelle mesure les droits à prestation reflètent-ils explicitement les besoins de santé de la population ?"}]
[]
[]
[null,null,null,null,{"$f":"'Print your results Full'!E333","v":"Q5.4"},null,{"$f":"'Print your results Full'!G333","v":"Dans quelle mesure les prestations accordent-elles la priorité aux catégories de population prioritaires, par exemple pour une meilleure utilisation des services hautement prioritaires et pour la protection financière ?"}]
[]
[]
[null,null,null,null,{"$f":"'Print your results Full'!E336","v":"Q5.5"},null,{"$f":"'Print your results Full'!G336","v":"Dans quelle mesure les droits et obligations de la population sont-ils explicitement définis et compris par les intéressés ?"}]
[]
[]
[null,null,null,null,{"$f":"'Print your results Full'!E339","v":"Q5.6"},null,{"$f":"'Print your results Full'!G339","v":"Dans quelle mesure les prestations sont-elles alignées sur le paiement des prestataires, afin de s’assurer qu’elles sont fournies et que les patients bénéficient d’une protection financière ?"}]
[]
[]
[null,null,null,null,{"$f":"'Print your results Full'!E342","v":"Q5.7"},null,{"$f":"'Print your results Full'!G342","v":"Dans quelle mesure les prestations, y compris le partage des coûts pour les patients, sont-elles alignées sur les recettes, afin d’assurer un financement adéquat des droits à prestations approuvés ?"}]
[]
[]
[null,"Points d’action"]
[null,{"$f":"'Print your results Full'!B346","v":""}]
[]
[401]
[]
[437]
[null,null,null,"CHECK THIS PARTE"]
[]
[]
[]
[]
[]
[]
[]
[]
[]
[]
[]
[]
[]
[]
[]
[]
[]
[]
[]
[]
[]
[]
[]
[]
[463]
[]
[]
[468]
[null,null,null,null,null,null,null,null,null,null,null,null,null,null,null,null,null,{"$f":"R227","v":"Votre évaluation"}]
[]
[null,{"$f":"Results!B41","v":"Gestion des finances publiques (GFP)"},null,{"$f":"Results!A41","v":6.1},{"$f":"Results!D41","v":"Est-ce qu’un diagnostic/une évaluation approfondi(e) des goulets d’étranglement de la GFP dans le secteur de la santé a été effectué(e) récemment, par exemple au cours des trois dernières années ?"}]
[]
[null,null,null,{"$f":"Results!A42","v":6.2},{"$f":"Results!D42","v":"Le personnel du Ministère de la santé dispose-t-il de capacités à comprendre les (nouvelles) règles de GFP et à les appliquer au processus budgétaire du secteur de la santé ?"}]
[]
[null,null,null,{"$f":"Results!A43","v":6.3},{"$f":"Results!D43","v":"Existe-il un processus budgétaire pluriannuel mis en œuvre efficacement ?"}]
[]
[null,null,null,{"$f":"Results!A44","v":6.4},{"$f":"Results!D44","v":"Dans quelle mesure les allocations budgétaires annuelles en matière de santé sont alignées sur les priorités du secteur de la santé (niveau, structure, nature/objectif) ?"}]
[]
[null,null,null,{"$f":"Results!A45","v":6.5},{"$f":"Results!D45","v":"Dans quelle mesure le processus budgétaire est consultatif, transparent et un processus d’examen et d’ajustement budgétaire à mi-parcours est établi ?"}]
[]
[null,null,null,{"$f":"Results!A46","v":6.6},{"$f":"Results!D46","v":"Dans quelle mesure les transferts fiscaux sont conçus et mis en œuvre de sorte à améliorer l’équité de la distribution des ressources dans le secteur de la santé?"}]
[]
[null,null,null,{"$f":"Results!A47","v":6.7},{"$f":"Results!D47","v":"Dans quelle mesure les règles du budget de la santé permettent-elles une certaine souplesse des dépenses? "}]
[]
[null,null,null,{"$f":"Results!A48","v":6.8},{"$f":"Results!D48","v":"La flexibilité dans l’utilisation des ressources est-elle assurée ou déléguée au bon niveau?"}]
[]
[null,null,null,{"$f":"Results!A49","v":6.9},{"$f":"Results!D49","v":"Dans quelle mesure des politiques de discipline budgétaire visant à contrôler les dépenses sont en vigueur (par exemple, gestion de la trésorerie, respect des règles d’approvisionnement) et mises en œuvre efficacement?"}]
[]
[null,null,null,{"$f":"Results!A50","v":6.15},{"$f":"Results!D50","v":"Dans quelle mesure des systèmes d’information sont en place pour répondre aux besoins en matière de responsabilité financière et pour assurer le suivi des performances du secteur de la santé?"}]
[]
[null,null,null,{"$f":"Results!A51","v":6.16},{"$f":"Results!D51","v":"Dans quelle mesure les flux financiers multiples, la structure budgétaire et les règles de GFP sont alignés sur les politiques d’achats stratégiques?"}]
[]
[null,"Points d’action"]
[null,{"$f":"TA.6","v":0}]
[494]
[]
[]
[530]
[]
[null,null,null,null,null,null,null,null,null,null,null,null,null,null,null,null,null,null,"Votre évaluation"]
[]
[null,{"$f":"'Print your results Full'!B466","v":"Gouvernance"},null,{"$f":"'Print your results Full'!D466","v":"Q7.1"},{"$f":"'Print your results Full'!E466","v":"Dans quelle mesure les rôles et les responsabilités (liés aux objectifs de financement de la santé et au rendement en matière de collecte de recettes, de mise en commun, d’achats, de prestations, etc.) sont clairement définis et répartis entre les institutions responsables du financement de la santé ?"}]
[]
[]
[null,null,null,{"$f":"'Print your results Full'!D469","v":"Q7.2"},{"$f":"'Print your results Full'!E469","v":"Dans quelle mesure les institutions responsables du financement de la santé disposent-elles de capacités adéquates, notamment en matière de ressources humaines (capacités techniques et managériales) et de TIC ?"}]
[]
[]
[null,null,null,{"$f":"'Print your results Full'!D472","v":"Q7.3"},{"$f":"'Print your results Full'!E472","v":"Dans quelle mesure les mécanismes de responsabilisation des organismes d’achat/de financement (y compris l’autonomie et le conseil d’administration de l’agence d’assurance-maladie, les mécanismes de récompense/sanction, etc.) sont-ils en place pour s’assurer que la politique de financement de la santé appuie les progrès vers les objectifs du secteur et que les fonds sont utilisés efficacement pour les populations, programmes et services prioritaires ?"}]
[]
[]
[null,null,null,{"$f":"'Print your results Full'!D475","v":"Q7.4"},{"$f":"'Print your results Full'!E475","v":"L’utilisation des fonds ou les performances des institutions achetant des services auprès des prestataires de services de santé ou le budget de la santé ont-ils été communiqués au public (par exemple sous forme de rapport annuel) ?"}]
[]
[]
[null,null,null,{"$f":"'Print your results Full'!D478","v":"Q7.5"},{"$f":"'Print your results Full'!E478","v":"Dans quelle mesure le Ministère des finances, le Ministère de la santé et l’organisme national d’assurance-maladie participent au processus d’élaboration des politiques de financement de la santé et en sont informés ?"}]
[]
[]
[null,null,null,{"$f":"'Print your results Full'!D481","v":"Q7.6"},{"$f":"'Print your results Full'!E481","v":"Dans quelle mesure le processus d’élaboration des politiques de financement de la santé est transparent et participatif?"}]
[]
[]
[null,"Points d’action"]
[null,{"$f":"'Print your results Full'!B485","v":""}]
[]
[556]
[]
[]
[null,null,{"$f":"'Print your results Full'!C542:AE542","v":"MATRICE DE PROGRÈS POUR LE FINANCEMENT DE LA SANTÉ"}]
[]
[null,null,{"$f":"'Print your results Full'!C544:AE544","v":"OBJECTIFS DU SYSTÈME DE SANTÉ"}]
[]
[null,null,{"$f":"'Print your results Full'!C546","v":"La plupart des problèmes abordés dans les questions de la matrice ont une influence sur les performances du système de santé ; par exemple, une utilisation accrue des recettes publiques devrait améliorer la protection financière. L’OMS fait correspondre chaque question aux objectifs et buts des systèmes de santé, et les revoit en permanence. Sur cette page, vous pouvez voir un résumé des résultats que vous avez obtenus par rapport à ces objectifs. Ainsi, par exemple, lorsque votre évaluation reflète une situation bien avancée, ou des progrès considérables, l’effet sur les performances du système de santé est supposé être plus marqué, et ce qui apparaît ci-dessous par une teinte bleue plus sombre."}]
[]
[]
[]
[]
[]
[null,null,null,{"$f":"'Print your results Full'!D552","v":"Questions"},null,null,null,null,null,null,null,null,null,null,null,null,null,{"$f":"'Print your results Full'!R552:S552","v":"Efficience"},null,{"$f":"'Print your results Full'!T552:U552","v":"Équité dans la distribution des ressources"},null,{"$f":"'Print your results Full'!V552:W552","v":"Transparence et responsabilité"},null,{"$f":"'Print your results Full'!X552:Y552","v":"Équité des financements"},null,{"$f":"'Print your results Full'!Z552:AA552","v":"Protection financière "},null,{"$f":"'Print your results Full'!AB552:AC552","v":"Qualité"},null,{"$f":"'Print your results Full'!AD552:AF552","v":"Utilisation par rapport aux besoins"}]
[null,null,{"$f":"'Print your results Full'!$C$553","v":"Collecte de recettes"},{"$f":"'Print your results Full'!D553","v":"Q2.1"},{"$f":"'Print your results Full'!E553:Q553","v":"Quelle approche est en vigueur dans votre pays en matière d’élaboration de politiques et de stratégies de collecte de revenus ? Cette approche s'inscrit-elle dans le cadre du processus global d’élaboration et de planification de la mise en œuvre des politiques de financement de la santé ?"},null,null,null,null,null,null,null,null,null,null,null,null,{"$f":"'Print your results Full'!R553","v":0},null,{"$f":"'Print your results Full'!T553","v":0},null,{"$f":"'Print your results Full'!V553","v":0},null,{"$f":"'Print your results Full'!X553","v":0},null,{"$f":"'Print your results Full'!Z553","v":0},null,{"$f":"'Print your results Full'!AB553","v":0},null,{"$f":"'Print your results Full'!AD553","v":0}]
[null,null,null,{"$f":"'Print your results Full'!D554","v":"Q2.2"},{"$f":"'Print your results Full'!E554:Q554","v":"Dans quelle mesure le financement de la santé dans votre pays repose-t-il sur des sources de financement public/obligatoire (par exemple, fiscalité/recettes publiques, y compris les cotisations obligatoires à l’assurance-maladie nationale/sociale) ?"},null,null,null,null,null,null,null,null,null,null,null,null,{"$f":"'Print your results Full'!R554","v":0},null,{"$f":"'Print your results Full'!T554","v":0},null,{"$f":"'Print your results Full'!V554","v":0},null,{"$f":"'Print your results Full'!X554","v":0},null,{"$f":"'Print your results Full'!Z554","v":0},null,{"$f":"'Print your results Full'!AB554","v":0},null,{"$f":"'Print your results Full'!AD554","v":0}]
[null,null,null,{"$f":"'Print your results Full'!D555","v":"Q2.3"},{"$f":"'Print your results Full'!E555:Q555","v":"Dans quelle mesure le financement public de la santé dans votre pays est-il prédictible sur plusieurs années ?"},null,null,null,null,null,null,null,null,null,null,null,null,{"$f":"'Print your results Full'!R555","v":0},null,{"$f":"'Print your results Full'!T555","v":0},null,{"$f":"'Print your results Full'!V555","v":0},null,{"$f":"'Print your results Full'!X555","v":0},null,{"$f":"'Print your results Full'!Z555","v":0},null,{"$f":"'Print your results Full'!AB555","v":0},null,{"$f":"'Print your results Full'!AD555","v":0}]
[null,null,null,{"$f":"'Print your results Full'!D556","v":"Q2.4"},{"$f":"'Print your results Full'!E556:Q556","v":"Dans quelle mesure le flux de fonds publics est-il stable, notamment grâce à une exécution budgétaire régulière, c’est-à-dire un déblocage des fonds dans les délais, conformément aux budgets de santé approuvés ?"},null,null,null,null,null,null,null,null,null,null,null,null,{"$f":"'Print your results Full'!R556","v":0},null,{"$f":"'Print your results Full'!T556","v":0},null,{"$f":"'Print your results Full'!V556","v":0},null,{"$f":"'Print your results Full'!X556","v":0},null,{"$f":"'Print your results Full'!Z556","v":0},null,{"$f":"'Print your results Full'!AB556","v":0},null,{"$f":"'Print your results Full'!AD556","v":0}]
[null,null,null,{"$f":"'Print your results Full'!D557","v":"Q2.5"},{"$f":"'Print your results Full'!E557:Q557","v":"Dans quelle mesure les différentes sources de revenus sont-elles collectées de façon progressive (c.-à-d. en fonction de la capacité de payer), et partant de là favorisent l’équité dans le mode de financement du système de santé ?"},null,null,null,null,null,null,null,null,null,null,null,null,{"$f":"'Print your results Full'!R557","v":0},null,{"$f":"'Print your results Full'!T557","v":0},null,{"$f":"'Print your results Full'!V557","v":0},null,{"$f":"'Print your results Full'!X557","v":0},null,{"$f":"'Print your results Full'!Z557","v":0},null,{"$f":"'Print your results Full'!AB557","v":0},null,{"$f":"'Print your results Full'!AD557","v":0}]
[null,null,{"$f":"'Print your results Full'!C558","v":"Mise en commun des recettes"},{"$f":"'Print your results Full'!D558","v":"Q3.1"},{"$f":"'Print your results Full'!E558:Q558","v":"Cette question a été maintenant remplacé par l’étape 1 et le tableau de vue d’ensemble et ne constitue donc plus une question distincte. Merci de bien vous assurer que vous avez complété l’étape 1 car cela vous aidera à remplir les questions de cette section."},null,null,null,null,null,null,null,null,null,null,null,null,{"$f":"'Print your results Full'!R558:S558","v":0},null,{"$f":"'Print your results Full'!T558:U558","v":0},null,{"$f":"'Print your results Full'!V558:W558","v":0},null,{"$f":"'Print your results Full'!X558:Y558","v":0},null,{"$f":"'Print your results Full'!Z558:AA558","v":0},null,{"$f":"'Print your results Full'!AB558:AC558","v":0},null,{"$f":"'Print your results Full'!AD558:AE558","v":0}]
[null,null,null,{"$f":"'Print your results Full'!D559","v":"Q3.2"},{"$f":"'Print your results Full'!E559:Q559","v":"Dans le cadre du processus global d’élaboration et de planification de la mise en œuvre des politiques de financement de la santé, quelle est l’approche de votre pays en matière de dispositifs de mise en commun des ressources ?"},null,null,null,null,null,null,null,null,null,null,null,null,{"$f":"'Print your results Full'!R559:S559","v":0},null,{"$f":"'Print your results Full'!T559:U559","v":0},null,{"$f":"'Print your results Full'!V559:W559","v":0},null,{"$f":"'Print your results Full'!X559:Y559","v":0},null,{"$f":"'Print your results Full'!Z559:AA559","v":0},null,{"$f":"'Print your results Full'!AB559:AC559","v":0},null,{"$f":"'Print your results Full'!AD559:AE559","v":0}]
[null,null,null,{"$f":"'Print your results Full'!D560","v":"Q3.3"},{"$f":"'Print your results Full'!E560:Q560","v":"Dans quelle mesure la capacité de redistribution des fonds prépayés dans votre pays est-elle limitée par le cadre institutionnel du financement de la santé ?"},null,null,null,null,null,null,null,null,null,null,null,null,{"$f":"'Print your results Full'!R560:S560","v":0},null,{"$f":"'Print your results Full'!T560:U560","v":0},null,{"$f":"'Print your results Full'!V560:W560","v":0},null,{"$f":"'Print your results Full'!X560:Y560","v":0},null,{"$f":"'Print your results Full'!Z560:AA560","v":0},null,{"$f":"'Print your results Full'!AB560:AC560","v":0},null,{"$f":"'Print your results Full'!AD560:AE560","v":0}]
[null,null,null,{"$f":"'Print your results Full'!D561","v":"Q3.4"},{"$f":"'Print your results Full'!E561:Q561","v":"Y-a-il des mesures, dans la conception des prestations, le paiement des prestataires ou les systèmes sous-jacents non financiers, qui visent à contrecarrer les problèmes découlant de la fragmentation de l’architecture du financement de la santé ?"},null,null,null,null,null,null,null,null,null,null,null,null,{"$f":"'Print your results Full'!R561:S561","v":0},null,{"$f":"'Print your results Full'!T561:U561","v":0},null,{"$f":"'Print your results Full'!V561:W561","v":0},null,{"$f":"'Print your results Full'!X561:Y561","v":0},null,{"$f":"'Print your results Full'!Z561:AA561","v":0},null,{"$f":"'Print your results Full'!AB561:AC561","v":0},null,{"$f":"'Print your results Full'!AD561:AE561","v":0}]
[null,null,null,{"$f":"'Print your results Full'!D562:Q562","v":"Questions"},null,null,null,null,null,null,null,null,null,null,null,null,null,{"$f":"'Print your results Full'!R562:S562","v":"Efficience"},null,{"$f":"'Print your results Full'!T562:U562","v":"Équité dans la distribution des ressources"},null,{"$f":"'Print your results Full'!V562:W562","v":"Transparence et responsabilité"},null,{"$f":"'Print your results Full'!X562:Y562","v":"Équité des financements"},null,{"$f":"'Print your results Full'!Z562:AA562","v":"Protection financière "},null,{"$f":"'Print your results Full'!AB562:AC562","v":"Qualité"},null,{"$f":"'Print your results Full'!AD562:AF562","v":"Utilisation par rapport aux besoins"}]
[null,null,{"$f":"'Print your results Full'!C563","v":"Mise en commun des recettes"},{"$f":"'Print your results Full'!D563","v":"Q3.5"},{"$f":"'Print your results Full'!E563","v":"Dans quelle mesure les différentes sources de revenus et de financement sont-elles organisées de manière complémentaire, afin de financer un paquet de prestations pour l’ensemble de la population ?"},null,null,null,null,null,null,null,null,null,null,null,null,{"$f":"'Print your results Full'!R563:S563","v":0},null,{"$f":"'Print your results Full'!T563:U563","v":0},null,{"$f":"'Print your results Full'!V563:W563","v":0},null,{"$f":"'Print your results Full'!X563:Y563","v":0},null,{"$f":"'Print your results Full'!Z563:AA563","v":0},null,{"$f":"'Print your results Full'!AB563:AC563","v":0},null,{"$f":"'Print your results Full'!AD563:AE563","v":0}]
[null,null,null,{"$f":"'Print your results Full'!D564","v":"Q3.6"},{"$f":"'Print your results Full'!E564","v":"Dans quelle mesure les dispositifs d’assurance-maladie volontaire sont-ils une source d’inégalités, créant des effets de contagion potentiellement néfastes pour l’ensemble du système de santé ?"},null,null,null,null,null,null,null,null,null,null,null,null,{"$f":"'Print your results Full'!R564:S564","v":0},null,{"$f":"'Print your results Full'!T564:U564","v":0},null,{"$f":"'Print your results Full'!V564:W564","v":0},null,{"$f":"'Print your results Full'!X564:Y564","v":0},null,{"$f":"'Print your results Full'!Z564:AA564","v":0},null,{"$f":"'Print your results Full'!AB564:AC564","v":0},null,{"$f":"'Print your results Full'!AD564:AE564","v":0}]
[null,null,null,{"$f":"'Print your results Full'!D565","v":"Q3.7"},{"$f":"'Print your results Full'!E565","v":"Dans quelle mesure les flux financiers sont-ils incohérents et redondants, et empêchent d’utiliser efficacement le budget public et les fonds des donateurs ?"},null,null,null,null,null,null,null,null,null,null,null,null,{"$f":"'Print your results Full'!R565:S565","v":0},null,{"$f":"'Print your results Full'!T565:U565","v":0},null,{"$f":"'Print your results Full'!V565:W565","v":0},null,{"$f":"'Print your results Full'!X565:Y565","v":0},null,{"$f":"'Print your results Full'!Z565:AA565","v":0},null,{"$f":"'Print your results Full'!AB565:AC565","v":0},null,{"$f":"'Print your results Full'!AD565:AE565","v":0}]
[null,null,{"$f":"'Print your results Full'!C566","v":"Achats et paiement des prestataires"},{"$f":"'Print your results Full'!D566","v":"Q4.1"},{"$f":"'Print your results Full'!E566","v":"Dans quelle mesure les allocations de fonds aux acheteurs de niveau inférieur, par exemple les administrations locales, et/ou les taux de paiement aux prestataires sont-ils le reflet des besoins de santé de la population ?"},null,null,null,null,null,null,null,null,null,null,null,null,{"$f":"'Print your results Full'!R566:S566","v":0},null,{"$f":"'Print your results Full'!T566:U566","v":0},null,{"$f":"'Print your results Full'!V566:W566","v":0},null,{"$f":"'Print your results Full'!X566:Y566","v":0},null,{"$f":"'Print your results Full'!Z566:AA566","v":0},null,{"$f":"'Print your results Full'!AB566:AC566","v":0},null,{"$f":"'Print your results Full'!AD566:AE566","v":0}]
[null,null,null,{"$f":"'Print your results Full'!D567","v":"Q4.2"},{"$f":"'Print your results Full'!E567","v":"Dans quelle mesure les paiements des prestataires sont-ils harmonisés entre régimes/sources de revenus et entre secteurs public et privé, afin de garantir des incitations cohérentes aux prestataires ?"},null,null,null,null,null,null,null,null,null,null,null,null,{"$f":"'Print your results Full'!R567:S567","v":0},null,{"$f":"'Print your results Full'!T567:U567","v":0},null,{"$f":"'Print your results Full'!V567:W567","v":0},null,{"$f":"'Print your results Full'!X567:Y567","v":0},null,{"$f":"'Print your results Full'!Z567:AA567","v":0},null,{"$f":"'Print your results Full'!AB567:AC567","v":0},null,{"$f":"'Print your results Full'!AD567:AE567","v":0}]
[null,null,null,{"$f":"'Print your results Full'!D568","v":"Q4.3"},{"$f":"'Print your results Full'!E568","v":"Dans quelle mesure les méthodes de paiement des prestataires et les achats en général favorisent-ils la qualité des soins et la coordination des soins entre les spécialités et les différents niveaux de soins ?"},null,null,null,null,null,null,null,null,null,null,null,null,{"$f":"'Print your results Full'!R568:S568","v":0},null,{"$f":"'Print your results Full'!T568:U568","v":0},null,{"$f":"'Print your results Full'!V568:W568","v":0},null,{"$f":"'Print your results Full'!X568:Y568","v":0},null,{"$f":"'Print your results Full'!Z568:AA568","v":0},null,{"$f":"'Print your results Full'!AB568:AC568","v":0},null,{"$f":"'Print your results Full'!AD568:AE568","v":0}]
[null,null,null,{"$f":"'Print your results Full'!D569","v":"Q4.4"},{"$f":"'Print your results Full'!E569","v":"Dans quelle mesure les contrats d’achat précisent-ils des exigences en matière de qualité des soins, y compris la disponibilité et la pertinence des soins, puis vérifient-ils de façon régulière qu’elles sont bien respectées ?"},null,null,null,null,null,null,null,null,null,null,null,null,{"$f":"'Print your results Full'!R569:S569","v":0},null,{"$f":"'Print your results Full'!T569:U569","v":0},null,{"$f":"'Print your results Full'!V569:W569","v":0},null,{"$f":"'Print your results Full'!X569:Y569","v":0},null,{"$f":"'Print your results Full'!Z569:AA569","v":0},null,{"$f":"'Print your results Full'!AB569:AC569","v":0},null,{"$f":"'Print your results Full'!AD569:AE569","v":0}]
[null,null,null,{"$f":"'Print your results Full'!D570","v":"Q4.5"},{"$f":"'Print your results Full'!E570","v":"Dans quelle mesure les méthodes de paiement des prestataires favorisent-elles l’efficacité de l’allocation des ressources, par exemple en réduisant la prestation excessive ou en augmentant celle insuffisante des services, et gèrent-elles la croissance des dépenses ?"},null,null,null,null,null,null,null,null,null,null,null,null,{"$f":"'Print your results Full'!R570:S570","v":0},null,{"$f":"'Print your results Full'!T570:U570","v":0},null,{"$f":"'Print your results Full'!V570:W570","v":0},null,{"$f":"'Print your results Full'!X570:Y570","v":0},null,{"$f":"'Print your results Full'!Z570:AA570","v":0},null,{"$f":"'Print your results Full'!AB570:AC570","v":0},null,{"$f":"'Print your results Full'!AD570:AE570","v":0}]
[null,null,null,{"$f":"'Print your results Full'!D571","v":"Q4.6"},{"$f":"'Print your results Full'!E571","v":"Dans quelle mesure les formulaires de consultation des patients sont-ils normalisés dans l'ensemble du système de santé et utilisés pour analyser et évaluer l'activité de l’ensemble des prestataires et de la population "},null,null,null,null,null,null,null,null,null,null,null,null,{"$f":"'Print your results Full'!R571:S571","v":0},null,{"$f":"'Print your results Full'!T571:U571","v":0},null,{"$f":"'Print your results Full'!V571:W571","v":0},null,{"$f":"'Print your results Full'!X571:Y571","v":0},null,{"$f":"'Print your results Full'!Z571:AA571","v":0},null,{"$f":"'Print your results Full'!AB571:AC571","v":0},null,{"$f":"'Print your results Full'!AD571:AE571","v":0}]
[null,null,null,{"$f":"'Print your results Full'!D572","v":"Q4.7"},{"$f":"'Print your results Full'!E572","v":"Dans quelle mesure les paiements des prestataires  couvrent  uniquement une partie ou l’ensemble des coûts totaux (y compris les salaires, les dépenses récurrentes, etc.) ?"},null,null,null,null,null,null,null,null,null,null,null,null,{"$f":"'Print your results Full'!R572:S572","v":0},null,{"$f":"'Print your results Full'!T572:U572","v":0},null,{"$f":"'Print your results Full'!V572:W572","v":0},null,{"$f":"'Print your results Full'!X572:Y572","v":0},null,{"$f":"'Print your results Full'!Z572:AA572","v":0},null,{"$f":"'Print your results Full'!AB572:AC572","v":0},null,{"$f":"'Print your results Full'!AD572:AE572","v":0}]
[null,null,null,{"$f":"'Print your results Full'!D573","v":"Q4.8"},{"$f":"'Print your results Full'!E573","v":"Dans quelle mesure les prestataires jouissent-ils d’une autonomie financière et sont-ils tenus responsables, dans une mesure réaliste et conforme à leurs capacités ?"},null,null,null,null,null,null,null,null,null,null,null,null,{"$f":"'Print your results Full'!R573:S573","v":0},null,{"$f":"'Print your results Full'!T573:U573","v":0},null,{"$f":"'Print your results Full'!V573:W573","v":0},null,{"$f":"'Print your results Full'!X573:Y573","v":0},null,{"$f":"'Print your results Full'!Z573:AA573","v":0},null,{"$f":"'Print your results Full'!AB573:AC573","v":0},null,{"$f":"'Print your results Full'!AD573:AE573","v":0}]
[null,null,null,{"$f":"'Print your results Full'!D574","v":"Q4.9"},{"$f":"'Print your results Full'!E574","v":"Dans quelle mesure l’accréditation des prestataires ou les contrats sélectifs sont-ils établis, fonctionnels et utilisés pour les achats ?"},null,null,null,null,null,null,null,null,null,null,null,null,{"$f":"'Print your results Full'!R574:S574","v":0},null,{"$f":"'Print your results Full'!T574:U574","v":0},null,{"$f":"'Print your results Full'!V574:W574","v":0},null,{"$f":"'Print your results Full'!X574:Y574","v":0},null,{"$f":"'Print your results Full'!Z574:AA574","v":0},null,{"$f":"'Print your results Full'!AB574:AC574","v":0},null,{"$f":"'Print your results Full'!AD574:AE574","v":0}]
[null,null,null,{"$f":"'Print your results Full'!D575","v":"Q4.10"},{"$f":"'Print your results Full'!E575","v":"Dans quelle mesure l’achat et le paiement des produits pharmaceutiques sont-ils mis en œuvre pour promouvoir l’utilisation efficace des médicaments (par exemple le recours aux génériques plutôt qu’aux princeps) et pour améliorer la protection financière des patients ?"},null,null,null,null,null,null,null,null,null,null,null,null,{"$f":"'Print your results Full'!R575:S575","v":0},null,{"$f":"'Print your results Full'!T575:U575","v":0},null,{"$f":"'Print your results Full'!V575:W575","v":0},null,{"$f":"'Print your results Full'!X575:Y575","v":0},null,{"$f":"'Print your results Full'!Z575:AA575","v":0},null,{"$f":"'Print your results Full'!AB575:AC575","v":0},null,{"$f":"'Print your results Full'!AD575:AE575","v":0}]
[null,null,null,{"$f":"'Print your results Full'!D576:Q576","v":"Questions"},null,null,null,null,null,null,null,null,null,null,null,null,null,{"$f":"'Print your results Full'!R576:S576","v":"Efficience"},null,{"$f":"'Print your results Full'!T576:U576","v":"Équité dans la distribution des ressources"},null,{"$f":"'Print your results Full'!V576:W576","v":"Transparence et responsabilité"},null,{"$f":"'Print your results Full'!X576:Y576","v":"Équité des financements"},null,{"$f":"'Print your results Full'!Z576:AA576","v":"Protection financière "},null,{"$f":"'Print your results Full'!AB576:AC576","v":"Qualité"},null,{"$f":"'Print your results Full'!AD576:AF576","v":"Utilisation par rapport aux besoins"}]
[null,null,{"$f":"'Print your results Full'!C577","v":"Prestations et droits"},{"$f":"'Print your results Full'!D577","v":"Q5.1"},{"$f":"'Print your results Full'!E577","v":"Cette question a été maintenant remplacé par l’étape 1 et le tableau de vue d’ensemble et ne constitue donc plus une question distincte. Merci de bien vous assurer que vous avez complété l’étape 1 car cela vous aidera à remplir les questions de cette section."},null,null,null,null,null,null,null,null,null,null,null,null,{"$f":"'Print your results Full'!R577:S577","v":0},null,{"$f":"'Print your results Full'!T577:U577","v":0},null,{"$f":"'Print your results Full'!V577:W577","v":0},null,{"$f":"'Print your results Full'!X577:Y577","v":0},null,{"$f":"'Print your results Full'!Z577:AA577","v":0},null,{"$f":"'Print your results Full'!AB577:AC577","v":0},null,{"$f":"'Print your results Full'!AD577:AE577","v":0}]
[null,null,null,{"$f":"'Print your results Full'!D578","v":"Q5.2"},{"$f":"'Print your results Full'!E578","v":"Dans quelle mesure les décisions et les révisions relatives aux prestations sont-elles prises de manière transparente, sur la base d’un processus clairement défini et de critères convenus, tels que le rapport coût-efficacité, la protection financière, l’impact budgétaire ?"},null,null,null,null,null,null,null,null,null,null,null,null,{"$f":"'Print your results Full'!R578:S578","v":0},null,{"$f":"'Print your results Full'!T578:U578","v":0},null,{"$f":"'Print your results Full'!V578:W578","v":0},null,{"$f":"'Print your results Full'!X578:Y578","v":0},null,{"$f":"'Print your results Full'!Z578:AA578","v":0},null,{"$f":"'Print your results Full'!AB578:AC578","v":0},null,{"$f":"'Print your results Full'!AD578:AE578","v":0}]
[null,null,null,{"$f":"'Print your results Full'!D579","v":"Q5.3"},{"$f":"'Print your results Full'!E579","v":"Dans quelle mesure les droits à prestation reflètent-ils explicitement les besoins de santé de la population ?"},null,null,null,null,null,null,null,null,null,null,null,null,{"$f":"'Print your results Full'!R579:S579","v":0},null,{"$f":"'Print your results Full'!T579:U579","v":0},null,{"$f":"'Print your results Full'!V579:W579","v":0},null,{"$f":"'Print your results Full'!X579:Y579","v":0},null,{"$f":"'Print your results Full'!Z579:AA579","v":0},null,{"$f":"'Print your results Full'!AB579:AC579","v":0},null,{"$f":"'Print your results Full'!AD579:AE579","v":0}]
[null,null,null,{"$f":"'Print your results Full'!D580","v":"Q5.4"},{"$f":"'Print your results Full'!E580","v":"Dans quelle mesure les prestations accordent-elles la priorité aux catégories de population prioritaires, par exemple pour une meilleure utilisation des services hautement prioritaires et pour la protection financière ?"},null,null,null,null,null,null,null,null,null,null,null,null,{"$f":"'Print your results Full'!R580:S580","v":0},null,{"$f":"'Print your results Full'!T580:U580","v":0},null,{"$f":"'Print your results Full'!V580:W580","v":0},null,{"$f":"'Print your results Full'!X580:Y580","v":0},null,{"$f":"'Print your results Full'!Z580:AA580","v":0},null,{"$f":"'Print your results Full'!AB580:AC580","v":0},null,{"$f":"'Print your results Full'!AD580:AE580","v":0}]
[null,null,null,{"$f":"'Print your results Full'!D581","v":"Q5.5"},{"$f":"'Print your results Full'!E581","v":"Dans quelle mesure les droits et obligations de la population sont-ils explicitement définis et compris par les intéressés ?"},null,null,null,null,null,null,null,null,null,null,null,null,{"$f":"'Print your results Full'!R581:S581","v":0},null,{"$f":"'Print your results Full'!T581:U581","v":0},null,{"$f":"'Print your results Full'!V581:W581","v":0},null,{"$f":"'Print your results Full'!X581:Y581","v":0},null,{"$f":"'Print your results Full'!Z581:AA581","v":0},null,{"$f":"'Print your results Full'!AB581:AC581","v":0},null,{"$f":"'Print your results Full'!AD581:AE581","v":0}]
[null,null,null,{"$f":"'Print your results Full'!D582","v":"Q5.6"},{"$f":"'Print your results Full'!E582","v":"Dans quelle mesure les prestations sont-elles alignées sur le paiement des prestataires, afin de s’assurer qu’elles sont fournies et que les patients bénéficient d’une protection financière ?"},null,null,null,null,null,null,null,null,null,null,null,null,{"$f":"'Print your results Full'!R582:S582","v":0},null,{"$f":"'Print your results Full'!T582:U582","v":0},null,{"$f":"'Print your results Full'!V582:W582","v":0},null,{"$f":"'Print your results Full'!X582:Y582","v":0},null,{"$f":"'Print your results Full'!Z582:AA582","v":0},null,{"$f":"'Print your results Full'!AB582:AC582","v":0},null,{"$f":"'Print your results Full'!AD582:AE582","v":0}]
[null,null,null,{"$f":"'Print your results Full'!D583","v":"Q5.7"},{"$f":"'Print your results Full'!E583","v":"Dans quelle mesure les prestations, y compris le partage des coûts pour les patients, sont-elles alignées sur les recettes, afin d’assurer un financement adéquat des droits à prestations approuvés ?"},null,null,null,null,null,null,null,null,null,null,null,null,{"$f":"'Print your results Full'!R583:S583","v":0},null,{"$f":"'Print your results Full'!T583:U583","v":0},null,{"$f":"'Print your results Full'!V583:W583","v":0},null,{"$f":"'Print your results Full'!X583:Y583","v":0},null,{"$f":"'Print your results Full'!Z583:AA583","v":0},null,{"$f":"'Print your results Full'!AB583:AC583","v":0},null,{"$f":"'Print your results Full'!AD583:AE583","v":0}]
[null,null,{"$f":"Results!B41","v":"Gestion des finances publiques (GFP)"},{"$f":"Objectives!E44","v":"Q6.1"},{"$f":"Objectives!F44","v":"Est-ce qu’un diagnostic/une évaluation approfondi(e) des goulets d’étranglement de la GFP dans le secteur de la santé a été effectué(e) récemment, par exemple au cours des trois dernières années ?"},null,null,null,null,null,null,null,null,null,null,null,null,{"$f":"Objectives!K44","v":0},null,{"$f":"Objectives!L44","v":0},null,{"$f":"Objectives!M44","v":0},null,{"$f":"Objectives!N44","v":0},null,{"$f":"Objectives!O44","v":0},null,{"$f":"Objectives!P44","v":0},null,{"$f":"Objectives!Q44","v":0}]
[null,null,null,{"$f":"Objectives!E45","v":"Q6.2"},{"$f":"Objectives!F45","v":"Le personnel du Ministère de la santé dispose-t-il de capacités à comprendre les (nouvelles) règles de GFP et à les appliquer au processus budgétaire du secteur de la santé ?"},null,null,null,null,null,null,null,null,null,null,null,null,{"$f":"Objectives!K45","v":0},null,{"$f":"Objectives!L45","v":0},null,{"$f":"Objectives!M45","v":0},null,{"$f":"Objectives!N45","v":0},null,{"$f":"Objectives!O45","v":0},null,{"$f":"Objectives!P45","v":0},null,{"$f":"Objectives!Q45","v":0}]
[null,null,null,{"$f":"Objectives!E46","v":"Q6.3"},{"$f":"Objectives!F46","v":"Existe-il un processus budgétaire pluriannuel mis en œuvre efficacement ?"},null,null,null,null,null,null,null,null,null,null,null,null,{"$f":"Objectives!K46","v":0},null,{"$f":"Objectives!L46","v":0},null,{"$f":"Objectives!M46","v":0},null,{"$f":"Objectives!N46","v":0},null,{"$f":"Objectives!O46","v":0},null,{"$f":"Objectives!P46","v":0},null,{"$f":"Objectives!Q46","v":0}]
[null,null,null,{"$f":"Objectives!E47","v":"Q6.4"},{"$f":"Objectives!F47","v":"Dans quelle mesure les allocations budgétaires annuelles en matière de santé sont alignées sur les priorités du secteur de la santé (niveau, structure, nature/objectif) ?"},null,null,null,null,null,null,null,null,null,null,null,null,{"$f":"Objectives!K47","v":0},null,{"$f":"Objectives!L47","v":0},null,{"$f":"Objectives!M47","v":0},null,{"$f":"Objectives!N47","v":0},null,{"$f":"Objectives!O47","v":0},null,{"$f":"Objectives!P47","v":0},null,{"$f":"Objectives!Q47","v":0}]
[null,null,null,{"$f":"Objectives!E48","v":"Q6.5"},{"$f":"Objectives!F48","v":"Dans quelle mesure le processus budgétaire est consultatif, transparent et un processus d’examen et d’ajustement budgétaire à mi-parcours est établi ?"},null,null,null,null,null,null,null,null,null,null,null,null,{"$f":"Objectives!K48","v":0},null,{"$f":"Objectives!L48","v":0},null,{"$f":"Objectives!M48","v":0},null,{"$f":"Objectives!N48","v":0},null,{"$f":"Objectives!O48","v":0},null,{"$f":"Objectives!P48","v":0},null,{"$f":"Objectives!Q48","v":0}]
[null,null,null,{"$f":"Objectives!E49","v":"Q6.6"},{"$f":"Objectives!F49","v":"Dans quelle mesure les transferts fiscaux sont conçus et mis en œuvre de sorte à améliorer l’équité de la distribution des ressources dans le secteur de la santé?"},null,null,null,null,null,null,null,null,null,null,null,null,{"$f":"Objectives!K49","v":0},null,{"$f":"Objectives!L49","v":0},null,{"$f":"Objectives!M49","v":0},null,{"$f":"Objectives!N49","v":0},null,{"$f":"Objectives!O49","v":0},null,{"$f":"Objectives!P49","v":0},null,{"$f":"Objectives!Q49","v":0}]
[null,null,null,{"$f":"D375","v":"Questions"},null,null,null,null,null,null,null,null,null,null,null,null,null,{"$f":"R375","v":"Efficience"},{"$f":"S375","v":0},"Équité dans la distribution des ressources",0,"Transparence et responsabilité",0,"Équité des financements",0,"Protection financière ",0,"Qualité",0,"Utilisation par rapport aux besoins",0,0]
[null,null,{"$f":"Results!B41","v":"Gestion des finances publiques (GFP)"},{"$f":"Objectives!E50","v":"Q6.7"},{"$f":"Objectives!F50","v":"Dans quelle mesure les règles du budget de la santé permettent-elles une certaine souplesse des dépenses? "},null,null,null,null,null,null,null,null,null,null,null,null,{"$f":"Objectives!K50","v":0},null,{"$f":"Objectives!L50","v":0},null,{"$f":"Objectives!M50","v":0},null,{"$f":"Objectives!N50","v":0},null,{"$f":"Objectives!O50","v":0},null,{"$f":"Objectives!P50","v":0},null,{"$f":"Objectives!Q50","v":0}]
[null,null,null,{"$f":"Objectives!E51","v":"Q6.8"},{"$f":"Objectives!F51","v":"La flexibilité dans l’utilisation des ressources est-elle assurée ou déléguée au bon niveau?"},null,null,null,null,null,null,null,null,null,null,null,null,{"$f":"Objectives!K51","v":0},null,{"$f":"Objectives!L51","v":0},null,{"$f":"Objectives!M51","v":0},null,{"$f":"Objectives!N51","v":0},null,{"$f":"Objectives!O51","v":0},null,{"$f":"Objectives!P51","v":0},null,{"$f":"Objectives!Q51","v":0}]
[null,null,null,{"$f":"Objectives!E52","v":"Q6.9"},{"$f":"Objectives!F52","v":"Dans quelle mesure des politiques de discipline budgétaire visant à contrôler les dépenses sont en vigueur (par exemple, gestion de la trésorerie, respect des règles d’approvisionnement) et mises en œuvre efficacement?"},null,null,null,null,null,null,null,null,null,null,null,null,{"$f":"Objectives!K52","v":0},null,{"$f":"Objectives!L52","v":0},null,{"$f":"Objectives!M52","v":0},null,{"$f":"Objectives!N52","v":0},null,{"$f":"Objectives!O52","v":0},null,{"$f":"Objectives!P52","v":0},null,{"$f":"Objectives!Q52","v":0}]
[null,null,null,{"$f":"Objectives!E53","v":"Q6.10"},{"$f":"Objectives!F53","v":"Dans quelle mesure des systèmes d’information sont en place pour répondre aux besoins en matière de responsabilité financière et pour assurer le suivi des performances du secteur de la santé?"},null,null,null,null,null,null,null,null,null,null,null,null,{"$f":"Objectives!K53","v":0},null,{"$f":"Objectives!L53","v":0},null,{"$f":"Objectives!M53","v":0},null,{"$f":"Objectives!N53","v":0},null,{"$f":"Objectives!O53","v":0},null,{"$f":"Objectives!P53","v":0},null,{"$f":"Objectives!Q53","v":0}]
[null,null,null,{"$f":"Objectives!E54","v":"Q6.11"},{"$f":"Objectives!F54","v":"Dans quelle mesure les flux financiers multiples, la structure budgétaire et les règles de GFP sont alignés sur les politiques d’achats stratégiques?"},null,null,null,null,null,null,null,null,null,null,null,null,{"$f":"Objectives!K54","v":0},null,{"$f":"Objectives!L54","v":0},null,{"$f":"Objectives!M54","v":0},null,{"$f":"Objectives!N54","v":0},null,{"$f":"Objectives!O54","v":0},null,{"$f":"Objectives!P54","v":0},null,{"$f":"Objectives!Q54","v":0}]
[null,null,{"$f":"'Print your results Full'!C584","v":"Gouvernance"},{"$f":"'Print your results Full'!D584","v":"Q7.1"},{"$f":"'Print your results Full'!E584","v":"Dans quelle mesure les rôles et les responsabilités (liés aux objectifs de financement de la santé et au rendement en matière de collecte de recettes, de mise en commun, d’achats, de prestations, etc.) sont clairement définis et répartis entre les institutions responsables du financement de la santé ?"},null,null,null,null,null,null,null,null,null,null,null,null,{"$f":"'Print your results Full'!R584:S584","v":0},null,{"$f":"'Print your results Full'!T584:U584","v":0},null,{"$f":"'Print your results Full'!V584:W584","v":0},null,{"$f":"'Print your results Full'!X584:Y584","v":0},null,{"$f":"'Print your results Full'!Z584:AA584","v":0},null,{"$f":"'Print your results Full'!AB584:AC584","v":0},null,{"$f":"'Print your results Full'!AD584:AE584","v":0}]
[null,null,null,{"$f":"'Print your results Full'!D585","v":"Q7.2"},{"$f":"'Print your results Full'!E585","v":"Dans quelle mesure les institutions responsables du financement de la santé disposent-elles de capacités adéquates, notamment en matière de ressources humaines (capacités techniques et managériales) et de TIC ?"},null,null,null,null,null,null,null,null,null,null,null,null,{"$f":"'Print your results Full'!R585:S585","v":0},null,{"$f":"'Print your results Full'!T585:U585","v":0},null,{"$f":"'Print your results Full'!V585:W585","v":0},null,{"$f":"'Print your results Full'!X585:Y585","v":0},null,{"$f":"'Print your results Full'!Z585:AA585","v":0},null,{"$f":"'Print your results Full'!AB585:AC585","v":0},null,{"$f":"'Print your results Full'!AD585:AE585","v":0}]
[null,null,null,{"$f":"'Print your results Full'!D586","v":"Q7.3"},{"$f":"'Print your results Full'!E586","v":"Dans quelle mesure les mécanismes de responsabilisation des organismes d’achat/de financement (y compris l’autonomie et le conseil d’administration de l’agence d’assurance-maladie, les mécanismes de récompense/sanction, etc.) sont-ils en place pour s’assurer que la politique de financement de la santé appuie les progrès vers les objectifs du secteur et que les fonds sont utilisés efficacement pour les populations, programmes et services prioritaires ?"},null,null,null,null,null,null,null,null,null,null,null,null,{"$f":"'Print your results Full'!R586:S586","v":0},null,{"$f":"'Print your results Full'!T586:U586","v":0},null,{"$f":"'Print your results Full'!V586:W586","v":0},null,{"$f":"'Print your results Full'!X586:Y586","v":0},null,{"$f":"'Print your results Full'!Z586:AA586","v":0},null,{"$f":"'Print your results Full'!AB586:AC586","v":0},null,{"$f":"'Print your results Full'!AD586:AE586","v":0}]
[null,null,null,{"$f":"'Print your results Full'!D587","v":"Q7.4"},{"$f":"'Print your results Full'!E587","v":"L’utilisation des fonds ou les performances des institutions achetant des services auprès des prestataires de services de santé ou le budget de la santé ont-ils été communiqués au public (par exemple sous forme de rapport annuel) ?"},null,null,null,null,null,null,null,null,null,null,null,null,{"$f":"'Print your results Full'!R587:S587","v":0},null,{"$f":"'Print your results Full'!T587:U587","v":0},null,{"$f":"'Print your results Full'!V587:W587","v":0},null,{"$f":"'Print your results Full'!X587:Y587","v":0},null,{"$f":"'Print your results Full'!Z587:AA587","v":0},null,{"$f":"'Print your results Full'!AB587:AC587","v":0},null,{"$f":"'Print your results Full'!AD587:AE587","v":0}]
[null,null,null,{"$f":"'Print your results Full'!D588","v":"Q7.5"},{"$f":"'Print your results Full'!E588","v":"Dans quelle mesure le Ministère des finances, le Ministère de la santé et l’organisme national d’assurance-maladie participent au processus d’élaboration des politiques de financement de la santé et en sont informés ?"},null,null,null,null,null,null,null,null,null,null,null,null,{"$f":"'Print your results Full'!R588:S588","v":0},null,{"$f":"'Print your results Full'!T588:U588","v":0},null,{"$f":"'Print your results Full'!V588:W588","v":0},null,{"$f":"'Print your results Full'!X588:Y588","v":0},null,{"$f":"'Print your results Full'!Z588:AA588","v":0},null,{"$f":"'Print your results Full'!AB588:AC588","v":0},null,{"$f":"'Print your results Full'!AD588:AE588","v":0}]
[null,null,null,{"$f":"'Print your results Full'!D589","v":"Q7.6"},{"$f":"'Print your results Full'!E589","v":"Dans quelle mesure le processus d’élaboration des politiques de financement de la santé est transparent et participatif?"},null,null,null,null,null,null,null,null,null,null,null,null,{"$f":"'Print your results Full'!R589:S589","v":0},null,{"$f":"'Print your results Full'!T589:U589","v":0},null,{"$f":"'Print your results Full'!V589:W589","v":0},null,{"$f":"'Print your results Full'!X589:Y589","v":0},null,{"$f":"'Print your results Full'!Z589:AA589","v":0},null,{"$f":"'Print your results Full'!AB589:AC589","v":0},null,{"$f":"'Print your results Full'!AD589:AE589","v":0}]
[]
[]
[]
[]
[]
[]
[]
[]
[]
[]
[]
[]
[]
[]
[]
[]
[]
[]
[]
[]
[]
[]
[]
[]
[]
[]
[]
[null,null,null,null,"CHECK THIS PART"]
[]
[]
[]
[]
[556]

{"sheet":"Print-Full","index":30,"n_rows":527,"n_cols":2,"rows_kept":527,"cut":false,"hidden":true,"merged":[[10,1,17,1],[21,1,29,1],[57,1,66,1],[69,1,93,1],[130,1,140,1]]}
[1]
[]
[]
[]
[]
[]
[]
[]
[]
[]
[null,{"$f":"Instructions!H19","v":0}]
[]
[]
[]
[]
[]
[]
[]
[]
[]
[]
[null,"MATRICE DE PROGRÈS POUR LE FINANCEMENT DE LA SANTÉ"]
[]
[]
[]
[]
[]
[]
[]
[]
[]
[]
[]
[]
[]
[]
[]
[]
[]
[]
[]
[]
[]
[]
[]
[]
[]
[]
[null,{"$f":"'Print your results Full'!D20","v":"Période couverte :"}]
[]
[null,{"$f":"'Print Excel'!B51","v":"0 -0"}]
[]
[]
[]
[]
[]
[null,{"$f":"'Print Excel'!B58","v":"Rempli par :"}]
[null,{"$f":"'Print Excel'!B59","v":0}]
[]
[]
[]
[]
[]
[]
[]
[]
[]
[]
[null,{"$f":"'Print Excel'!B70","v":"Processus suivi:"}]
[null,{"$f":"'Print Excel'!B71","v":0}]
[]
[]
[]
[]
[]
[]
[]
[]
[]
[]
[]
[]
[]
[]
[]
[]
[]
[]
[]
[]
[]
[]
[]
[]
[]
[]
[]
[]
[]
[]
[]
[]
[]
[]
[]
[]
[]
[]
[]
[]
[]
[]
[]
[]
[]
[]
[]
[]
[]
[]
[]
[]
[]
[]
[]
[]
[]
[]
[]
[]
[null,{"$f":"'Print Excel'!B124","v":"Nous tenons à remercier tous ceux qui ont contribué à l’élaboration des matrices de progrès dans le cadre d’une réunion d’examen qui s’est tenue à Genève en mai 2018. Ce travail a bénéficié du soutien financier de la République de Corée du Sud et du Royaume-Uni (don du DfID MCHSS), que nous tenons également à remercier vivement."}]
[]
[]
[]
[]
[]
[]
[]
[]
[]
[]
[]
[]
[]
[]
[]
[]
[]
[]
[]
[]
[]
[]
[]
[]
[]
[null,{"$f":"Results!P46","v":"Efficience"}]
[]
[]
[]
[]
[]
[]
[]
[]
[]
[]
[]
[]
[]
[]
[]
[]
[]
[null,{"$f":"IF(criteria1=0,\"\",Results!E63)","v":""}]
[]
[null,{"$f":"IF(criteria1=0,\"\",Results!A63)","v":""}]
[]
[]
[]
[]
[]
[]
[]
[]
[]
[]
[]
[]
[]
[]
[]
[]
[null,{"$f":"Results!Q47","v":"2.4 Dans quelle mesure le flux de fonds publics est-il stable, Serait-ce grâce à une exécution régulière, c’est-à-dire un déblocage des fonds dans les délais, conformément aux budgets de santé approuvés ?"}]
[]
[null,{"$f":"\"Scale = \"&Results!R47& \"/12\"","v":"Scale = 0/12"}]
[]
[null,{"$f":"Results!F15","v":""}]
[]
[null,{"$f":"Results!Q48","v":"3.2 Dans le cadre du processus global d’élaboration et de planification de la mise en œuvre des politiques de financement de la santé, quelle est l’approche de votre pays en matière de dispositifs de mise en commun des recettes ?"}]
[]
[null,{"$f":"\"Scale = \"&Results!R48& \"/12\"","v":"Scale = 0/12"}]
[]
[null,{"$f":"Results!F18","v":""}]
[]
[null,{"$f":"Results!Q49","v":"3.3 Dans quelle mesure la capacité de redistribution des fonds prépayés dans votre pays est-elle limitée par les accords institutionnels de financement de la santé ?"}]
[]
[null,{"$f":"\"Scale = \"&Results!R49& \"/12\"","v":"Scale = 0/12"}]
[]
[null,{"$f":"Results!F19","v":""}]
[]
[null,{"$f":"Results!Q50","v":"3.4 Y aurait-il des mesures, liées à la conception des prestations, au paiement des prestataires ou à des systèmes sous-jacents non financiers, qui ciblent les problèmes découlant de la fragmentation des caisses ?\n"}]
[]
[null,{"$f":"\"Scale = \"&Results!R50& \"/12\"","v":"Scale = 0/12"}]
[]
[null,{"$f":"Results!F20","v":""}]
[]
[null,{"$f":"Results!Q51","v":"3.5 Dans quelle mesure les différentes sources de recettes et de financement sont-elles organisées de manière complémentaire, afin de financer un paquet de prestations pour l’ensemble de la population ?"}]
[]
[null,{"$f":"\"Scale = \"&Results!R51& \"/12\"","v":"Scale = 0/12"}]
[]
[null,{"$f":"Results!F21","v":""}]
[]
[null,{"$f":"Results!Q52","v":"3.7 Dans quelle mesure les flux financiers sont-ils incohérents et redondants, et empêchent d’utiliser efficacement le budget public et les fonds des donateurs ?"}]
[]
[null,{"$f":"\"Scale = \"&Results!R52& \"/12\"","v":"Scale = 0/12"}]
[]
[null,{"$f":"Results!F23","v":""}]
[]
[null,{"$f":"Results!Q53","v":"4.5 Dans quelle mesure les méthodes de paiement des prestataires favorisent-elles l’efficacité de l’allocation des ressources, par exemple en réduisant la prestation excessive ou insuffisante des services, et gèrent-elles la croissance des dépenses ?"}]
[]
[null,{"$f":"\"Scale = \"&Results!R53& \"/12\"","v":"Scale = 0/12"}]
[]
[null,{"$f":"Results!F28","v":""}]
[]
[null,{"$f":"Results!Q54","v":"4.8 Dans quelle mesure les prestataires jouissent-ils d’une autonomie financière et sont-ils tenus responsables, dans une mesure réaliste et conforme à leurs capacités ?"}]
[]
[null,{"$f":"\"Scale = \"&Results!R54& \"/12\"","v":"Scale = 0/12"}]
[]
[null,{"$f":"Results!F31","v":""}]
[]
[null,{"$f":"Results!Q55","v":"4.9 Dans quelle mesure l’accréditation des prestataires ou les contrats sélectifs sont-ils établis, fonctionnels et utilisés pour les achats ?"}]
[]
[null,{"$f":"\"Scale = \"&Results!R55& \"/12\"","v":"Scale = 0/12"}]
[]
[null,{"$f":"Results!F32","v":""}]
[]
[null,{"$f":"Results!Q56","v":"4.10 Dans quelle mesure l’achat et le paiement des produits pharmaceutiques sont-ils mis en œuvre pour promouvoir l’utilisation efficace des médicaments (par ex. le recours aux génériques plutôt qu’aux princeps) et pour améliorer la protection financière des patients ?"}]
[]
[null,{"$f":"\"Scale = \"&Results!R56& \"/12\"","v":"Scale = 0/12"}]
[]
[null,{"$f":"Results!F33","v":""}]
[]
[null,{"$f":"Results!Q57","v":"6.7 Dans quelle mesure les règles du budget de la santé permettent-elles une certaine souplesse des dépenses? "}]
[]
[null,{"$f":"\"Scale = \"&Results!R57& \"/12\"","v":"Scale = 0/12"}]
[]
[null,{"$f":"Results!F47","v":""}]
[]
[null,{"$f":"Results!Q58","v":"6.8 La flexibilité dans l’utilisation des ressources est-elle assurée ou déléguée au bon niveau?"}]
[]
[null,{"$f":"\"Scale = \"&Results!R58& \"/12\"","v":"Scale = 0/12"}]
[]
[null,{"$f":"Results!F48","v":""}]
[]
[null,{"$f":"Results!Q59","v":"6.9 Dans quelle mesure des politiques de discipline budgétaire visant à contrôler les dépenses sont en rn vigueur (par ex. gestion de la trésorerie, respect des règles d’approvisionnement) et mises en œuvre efficacement?"}]
[]
[null,{"$f":"\"Scale = \"&Results!R59& \"/12\"","v":"Scale = 0/12"}]
[]
[null,{"$f":"Results!F49","v":""}]
[]
[null,{"$f":"Results!Q60","v":"6.11 Dans quelle mesure les flux financiers multiples, la structure budgétaire et les règles de GFP sont alignés sur les politiques d’achats stratégiques?"}]
[]
[null,{"$f":"\"Scale = \"&Results!R60& \"/12\"","v":"Scale = 0/12"}]
[]
[null,{"$f":"Results!F51","v":""}]
[]
[]
[]
[]
[]
[]
[]
[]
[null,{"$f":"Results!P63","v":"Équité dans la distribution des ressources"}]
[]
[]
[]
[]
[]
[]
[]
[]
[]
[]
[]
[]
[null,{"$f":"IF(criteria1=0,\"\",Results!E103)","v":""}]
[]
[null,{"$f":"IF(criteria1=0,\"\",Results!A103)","v":""}]
[]
[]
[]
[]
[]
[]
[]
[]
[]
[]
[]
[]
[]
[]
[]
[]
[]
[null,{"$f":"Results!Q64","v":"3.2 Dans le cadre du processus global d’élaboration et de planification de la mise en œuvre des politiques de financement de la santé, quelle est l’approche de votre pays en matière de dispositifs de mise en commun des recettes ?"}]
[]
[null,{"$f":"\"Scale = \"&Results!R64& \"/12\"","v":"Scale = 0/12"}]
[]
[null,{"$f":"Results!F18","v":""}]
[]
[null,{"$f":"Results!Q65","v":"3.3 Dans quelle mesure la capacité de redistribution des fonds prépayés dans votre pays est-elle limitée par les accords institutionnels de financement de la santé ?"}]
[]
[null,{"$f":"\"Scale = \"&Results!R65& \"/12\"","v":"Scale = 0/12"}]
[]
[null,{"$f":"Results!F19","v":""}]
[]
[null,{"$f":"Results!Q66","v":"3.4 Y aurait-il des mesures, liées à la conception des prestations, au paiement des prestataires ou à des systèmes sous-jacents non financiers, qui ciblent les problèmes découlant de la fragmentation des caisses ?\n"}]
[]
[null,{"$f":"\"Scale = \"&Results!R66& \"/12\"","v":"Scale = 0/12"}]
[]
[null,{"$f":"Results!F20","v":""}]
[]
[null,{"$f":"Results!Q67","v":"3.5 Dans quelle mesure les différentes sources de recettes et de financement sont-elles organisées de manière complémentaire, afin de financer un paquet de prestations pour l’ensemble de la population ?"}]
[]
[null,{"$f":"\"Scale = \"&Results!R67& \"/12\"","v":"Scale = 0/12"}]
[]
[null,{"$f":"Results!F21","v":""}]
[]
[null,{"$f":"Results!Q68","v":"3.6 Dans quelle mesure les dispositifs d’assurance-maladie volontaire sont-ils une source d’inégalités, créant des effets de contagion potentiellement néfastes pour l’ensemble du système de santé ?"}]
[]
[null,{"$f":"\"Scale = \"&Results!R68& \"/12\"","v":"Scale = 0/12"}]
[]
[null,{"$f":"Results!F22","v":""}]
[]
[null,{"$f":"Results!Q69","v":"4.1 Dans quelle mesure les allocations de fonds aux acheteurs de niveau inférieur, par exemple les administrations locales, et/ou les taux de paiement aux prestataires sont-ils le reflet des besoins de santé de la population ?\n"}]
[]
[null,{"$f":"\"Scale = \"&Results!R69& \"/12\"","v":"Scale = 0/12"}]
[]
[null,{"$f":"Results!F24","v":""}]
[]
[null,{"$f":"Results!Q70","v":"4.2 Dans quelle mesure les paiements des prestataires sont-ils harmonisés entre régimes/sources de recettes et entre secteurs public et privé, afin de garantir des incitations cohérentes aux prestataires ?"}]
[]
[null,{"$f":"\"Scale = \"&Results!R70& \"/12\"","v":"Scale = 0/12"}]
[]
[null,{"$f":"Results!F25","v":""}]
[]
[null,{"$f":"Results!Q71","v":"6.4 Mesure dans laquelle les allocations budgétaires annuelles en matière de santé sont alignées sur les priorités du secteur de la santé (niveau, structure, nature/objectif)"}]
[]
[null,{"$f":"\"Scale = \"&Results!R71& \"/12\"","v":"Scale = 0/12"}]
[]
[null,{"$f":"Results!F44","v":""}]
[]
[null,{"$f":"Results!Q72","v":"6.6 Dans quelle mesure les transferts fiscaux sont conçus et mis en œuvre de sorte à améliorer l’équité de la distribution des ressources dans le secteur de la santé?"}]
[]
[null,{"$f":"\"Scale = \"&Results!R72& \"/12\"","v":"Scale = 0/12"}]
[]
[null,{"$f":"Results!F46","v":""}]
[]
[null,{"$f":"Results!Q73","v":"6.11 Dans quelle mesure les flux financiers multiples, la structure budgétaire et les règles de GFP sont alignés sur les politiques d’achats stratégiques?"}]
[]
[null,{"$f":"\"Scale = \"&Results!R73& \"/12\"","v":"Scale = 0/12"}]
[]
[null,{"$f":"Results!F51","v":""}]
[]
[]
[]
[]
[]
[]
[]
[]
[]
[null,{"$f":"Results!P75","v":"Transparence et responsabilité"}]
[]
[]
[]
[]
[]
[]
[]
[]
[]
[]
[]
[]
[]
[]
[]
[]
[]
[]
[]
[]
[]
[]
[]
[]
[]
[]
[]
[]
[]
[]
[]
[]
[]
[]
[]
[]
[]
[]
[]
[]
[]
[]
[]
[]
[]
[]
[null,{"$f":"Results!Q76","v":"2.1 Quelle approche en matière d’élaboration de politiques et de stratégies de collecte de recettes est en vigueur dans votre pays? Cette approche s'inscrit-elle dans le cadre d’un processus global d’élaboration et de planification de la mise en œuvre des politiques de financement de la santé ?"}]
[]
[null,{"$f":"\"Scale = \"&Results!R76& \"/12\"","v":"Scale = 0/12"}]
[]
[null,{"$f":"Results!F12","v":""}]
[]
[null,{"$f":"Results!Q77","v":"2.3 Dans quelle mesure le financement public de la santé dans votre pays est-il prévisible sur plusieurs années ?"}]
[]
[null,{"$f":"\"Scale = \"&Results!R77& \"/12\"","v":"Scale = 0/12"}]
[]
[null,{"$f":"Results!F14","v":""}]
[]
[null,{"$f":"Results!Q78","v":"4.4 Dans quelle mesure les contrats d’achat précisent-ils des exigences en matière de qualité des soins, y compris la disponibilité et la pertinence des soins, puis vérifient-ils de façon régulière qu’elles sont bien respectées ?"}]
[]
[null,{"$f":"\"Scale = \"&Results!R78& \"/12\"","v":"Scale = 0/12"}]
[]
[null,{"$f":"Results!F27","v":""}]
[]
[null,{"$f":"Results!Q79","v":"4.8 Dans quelle mesure les prestataires jouissent-ils d’une autonomie financière et sont-ils tenus responsables, dans une mesure réaliste et conforme à leurs capacités ?"}]
[]
[null,{"$f":"\"Scale = \"&Results!R79& \"/12\"","v":"Scale = 0/12"}]
[]
[null,{"$f":"Results!F31","v":""}]
[]
[null,{"$f":"Results!Q80","v":"5.2 Dans quelle mesure les décisions et les révisions relatives aux prestations sont-elles prises de manière transparente, sur la base d’un processus clairement défini et de critères convenus, tels que le rapport coût-efficacité, la protection financière, l’impact budgétaire ?"}]
[]
[null,{"$f":"\"Scale = \"&Results!R80& \"/12\"","v":"Scale = 0/12"}]
[]
[null,{"$f":"Results!F35","v":""}]
[]
[null,{"$f":"Results!Q81","v":"5.5 Dans quelle mesure les droits et obligations de la population sont-ils explicitement définis et compris par les intéressés ?"}]
[]
[null,{"$f":"\"Scale = \"&Results!R81& \"/12\"","v":"Scale = 0/12"}]
[]
[null,{"$f":"Results!F38","v":""}]
[]
[null,{"$f":"Results!Q82","v":"5.7 Dans quelle mesure les prestations, y compris le partage des coûts pour les patients, sont-elles alignées sur les recettes, afin d’assurer un financement adéquat des droits à prestations approuvés ?"}]
[]
[null,{"$f":"\"Scale = \"&Results!R82& \"/12\"","v":"Scale = 0/12"}]
[]
[null,{"$f":"Results!F40","v":""}]
[]
[null,{"$f":"Results!Q83","v":"6.5 Mesure dans laquelle le processus budgétaire est consultatif, transparent et un processus d’examen et d’ajustement budgétaire à mi-parcours est établi."}]
[]
[null,{"$f":"\"Scale = \"&Results!R83& \"/12\"","v":"Scale = 0/12"}]
[]
[null,{"$f":"Results!F45","v":""}]
[]
[null,{"$f":"Results!Q84","v":"6.7 Dans quelle mesure les règles du budget de la santé permettent-elles une certaine souplesse des dépenses? "}]
[]
[null,{"$f":"\"Scale = \"&Results!R84& \"/12\"","v":"Scale = 0/12"}]
[]
[null,{"$f":"Results!F47","v":""}]
[]
[null,{"$f":"Results!Q85","v":"6.9 Dans quelle mesure des politiques de discipline budgétaire visant à contrôler les dépenses sont en rn vigueur (par ex. gestion de la trésorerie, respect des règles d’approvisionnement) et mises en œuvre efficacement?"}]
[]
[null,{"$f":"\"Scale = \"&Results!R85& \"/12\"","v":"Scale = 0/12"}]
[]
[null,{"$f":"Results!F49","v":""}]
[]
[null,{"$f":"Results!Q86","v":"7.1 Dans quelle mesure les rôles et les responsabilités (liés aux objectifs de financement de la santé et au rendement en matière de collecte de recettes, de mise en commun, d’achats, de prestations, etc.) sont clairement définis et répartis entre les institutions responsables du financement de la santé."}]
[]
[null,{"$f":"\"Scale = \"&Results!R86& \"/12\"","v":"Scale = 0/12"}]
[]
[null,{"$f":"Results!F52","v":""}]
[]
[null,{"$f":"Results!Q87","v":"7.2 Dans quelle mesure les institutions responsables du financement de la santé disposent-elles de capacités adéquates, notamment en matière de ressources humaines (capacités techniques et managériales) et de TIC ?"}]
[]
[null,{"$f":"\"Scale = \"&Results!R87& \"/12\"","v":"Scale = 0/12"}]
[]
[null,{"$f":"Results!F53","v":""}]
[]
[null,{"$f":"Results!Q88","v":"7.3 Dans quelle mesure les mécanismes de responsabilisation des organismes d’achat/de financement, y compris l’autonomie et le conseil d’administration de l’agence d’assurance-maladie, les mécanismes de récompense/sanction, etc. sont en place pour s’assurer que la politique de financement de la santé appuie les progrès vers les objectifs du secteur et que les fonds sont utilisés efficacement pour les populations, programmes et services prioritaires."}]
[]
[null,{"$f":"\"Scale = \"&Results!R88& \"/12\"","v":"Scale = 0/12"}]
[]
[null,{"$f":"Results!F54","v":""}]
[]
[null,{"$f":"Results!Q89","v":"7.4 L’utilisation des fonds ou les performances des institutions achetant des services auprès des prestataires de services de santé ou le budget de la santé ont-ils été communiqués au public (par ex. rapport annuel) ?"}]
[]
[null,{"$f":"\"Scale = \"&Results!R89& \"/12\"","v":"Scale = 0/12"}]
[]
[null,{"$f":"Results!F55","v":""}]
[]
[null,{"$f":"Results!Q90","v":"7.5 Dans quelle mesure le Ministère des finances, le Ministère de la santé et l’organisme national d’assurance-maladie participent au processus d’élaboration des politiques de financement de la santé et en sont informés."}]
[]
[null,{"$f":"\"Scale = \"&Results!R90& \"/12\"","v":"Scale = 0/12"}]
[]
[null,{"$f":"Results!F56","v":""}]
[]
[null,{"$f":"Results!Q91","v":"7.6 Dans quelle mesure le processus d’élaboration des politiques de financement de la santé est transparent et participatif?"}]
[]
[null,{"$f":"\"Scale = \"&Results!R91& \"/12\"","v":"Scale = 0/12"}]
[]
[null,{"$f":"Results!F57","v":""}]

{"sheet":"Print-Full2","index":31,"n_rows":448,"n_cols":2,"rows_kept":448,"cut":false,"hidden":true,"merged":[]}
[1]
[]
[]
[null,{"$f":"Results!P93","v":"Équité des financements"}]
[]
[]
[]
[]
[]
[]
[]
[]
[]
[]
[]
[]
[]
[]
[]
[]
[]
[]
[]
[]
[]
[]
[]
[]
[]
[]
[]
[]
[]
[]
[]
[]
[]
[]
[]
[]
[]
[]
[]
[]
[]
[]
[null,{"$f":"Results!Q94","v":"2.1 Quelle approche en matière d’élaboration de politiques et de stratégies de collecte de recettes est en vigueur dans votre pays? Cette approche s'inscrit-elle dans le cadre d’un processus global d’élaboration et de planification de la mise en œuvre des politiques de financement de la santé ?"}]
[]
[null,{"$f":"\"Scale = \"&Results!R94& \"/12\"","v":"Scale = 0/12"}]
[]
[null,{"$f":"Results!F12","v":""}]
[]
[null,{"$f":"Results!Q95","v":"2.2 Dans quelle mesure le financement de la santé dans votre pays repose-t-il sur des sources de financement public/obligatoire (par exemple, fiscalité/recettes publiques, y compris les cotisations obligatoires à l’assurance-maladie nationale/sociale) ?\n"}]
[]
[null,{"$f":"\"Scale = \"&Results!R95& \"/12\"","v":"Scale = 0/12"}]
[]
[null,{"$f":"Results!F13","v":""}]
[]
[null,{"$f":"Results!Q96","v":"2.4 Dans quelle mesure le flux de fonds publics est-il stable, Serait-ce grâce à une exécution régulière, c’est-à-dire un déblocage des fonds dans les délais, conformément aux budgets de santé approuvés ?"}]
[]
[null,{"$f":"\"Scale = \"&Results!R96& \"/12\"","v":"Scale = 0/12"}]
[]
[null,{"$f":"Results!F15","v":""}]
[]
[null,{"$f":"Results!Q97","v":"2.5 Dans quelle mesure les différentes sources de recettes sont-elles obtenues de façon progressive (c.-à-d. en fonction de la capacité de payer), et partant favorisent l’équité dans le mode de financement du système de santé ?"}]
[]
[null,{"$f":"\"Scale = \"&Results!R97& \"/12\"","v":"Scale = 0/12"}]
[]
[null,{"$f":"Results!F16","v":""}]
[]
[null,{"$f":"Results!Q98","v":"3.4 Y aurait-il des mesures, liées à la conception des prestations, au paiement des prestataires ou à des systèmes sous-jacents non financiers, qui ciblent les problèmes découlant de la fragmentation des caisses ?"}]
[]
[null,{"$f":"\"Scale = \"&Results!R98& \"/12\"","v":"Scale = 0/12"}]
[]
[null,{"$f":"Results!F20","v":""}]
[]
[null,{"$f":"Results!Q99","v":"3.6 Dans quelle mesure les dispositifs d’assurance-maladie volontaire sont-ils une source d’inégalités, créant des effets de contagion potentiellement néfastes pour l’ensemble du système de santé ?"}]
[]
[null,{"$f":"\"Scale = \"&Results!R99& \"/12\"","v":"Scale = 0/12"}]
[]
[null,{"$f":"Results!F22","v":""}]
[]
[null,{"$f":"Results!Q100","v":"4.10 Dans quelle mesure l’achat et le paiement des produits pharmaceutiques sont-ils mis en œuvre pour promouvoir l’utilisation efficace des médicaments (par ex. le recours aux génériques plutôt qu’aux princeps) et pour améliorer la protection financière des patients ?"}]
[]
[null,{"$f":"\"Scale = \"&Results!R100& \"/12\"","v":"Scale = 0/12"}]
[]
[null,{"$f":"Results!F33","v":""}]
[]
[null,{"$f":"Results!Q101","v":"5.4 Dans quelle mesure les prestations accordent-elles la priorité aux catégories de population prioritaires, par exemple pour une meilleure utilisation des services hautement prioritaires et la protection financière ?"}]
[]
[null,{"$f":"\"Scale = \"&Results!R101& \"/12\"","v":"Scale = 0/12"}]
[]
[null,{"$f":"Results!F37","v":""}]
[]
[null,{"$f":"Results!Q102","v":"5.6 Dans quelle mesure les prestations sont-elles alignées sur le paiement des prestataires, afin de s’assurer qu’elles sont fournies et que les patients bénéficient d’une protection financière ?"}]
[]
[null,{"$f":"\"Scale = \"&Results!R102& \"/12\"","v":"Scale = 0/12"}]
[]
[null,{"$f":"Results!F39","v":""}]
[]
[null,{"$f":"Results!P104","v":"Protection financière "}]
[]
[]
[]
[]
[]
[]
[]
[]
[]
[]
[]
[]
[]
[]
[]
[]
[]
[]
[]
[]
[]
[]
[]
[]
[]
[]
[]
[]
[]
[]
[]
[]
[]
[]
[]
[]
[]
[]
[]
[]
[]
[]
[]
[null,{"$f":"Results!Q105","v":"2.1 Quelle approche en matière d’élaboration de politiques et de stratégies de collecte de recettes est en vigueur dans votre pays? Cette approche s'inscrit-elle dans le cadre d’un processus global d’élaboration et de planification de la mise en œuvre des politiques de financement de la santé ?"}]
[]
[null,{"$f":"\"Scale = \"&Results!R105& \"/12\"","v":"Scale = 0/12"}]
[]
[null,{"$f":"Results!F12","v":""}]
[]
[null,{"$f":"Results!Q106","v":"2.2 Dans quelle mesure le financement de la santé dans votre pays repose-t-il sur des sources de financement public/obligatoire (par exemple, fiscalité/recettes publiques, y compris les cotisations obligatoires à l’assurance-maladie nationale/sociale) ?\n"}]
[]
[null,{"$f":"\"Scale = \"&Results!R106& \"/12\"","v":"Scale = 0/12"}]
[]
[null,{"$f":"Results!F13","v":""}]
[]
[null,{"$f":"Results!Q107","v":"2.4 Dans quelle mesure le flux de fonds publics est-il stable, Serait-ce grâce à une exécution régulière, c’est-à-dire un déblocage des fonds dans les délais, conformément aux budgets de santé approuvés ?"}]
[]
[null,{"$f":"\"Scale = \"&Results!R107& \"/12\"","v":"Scale = 0/12"}]
[]
[null,{"$f":"Results!F15","v":""}]
[]
[null,{"$f":"Results!Q108","v":"2.5 Dans quelle mesure les différentes sources de recettes sont-elles obtenues de façon progressive (c.-à-d. en fonction de la capacité de payer), et partant favorisent l’équité dans le mode de financement du système de santé ?"}]
[]
[null,{"$f":"\"Scale = \"&Results!R108& \"/12\"","v":"Scale = 0/12"}]
[]
[null,{"$f":"Results!F16","v":""}]
[]
[null,{"$f":"Results!Q109","v":"3.2 Dans le cadre du processus global d’élaboration et de planification de la mise en œuvre des politiques de financement de la santé, quelle est l’approche de votre pays en matière de dispositifs de mise en commun des recettes ?"}]
[]
[null,{"$f":"\"Scale = \"&Results!R109& \"/12\"","v":"Scale = 0/12"}]
[]
[null,{"$f":"Results!F18","v":""}]
[]
[null,{"$f":"Results!Q110","v":"3.3 Dans quelle mesure la capacité de redistribution des fonds prépayés dans votre pays est-elle limitée par les accords institutionnels de financement de la santé ?"}]
[]
[null,{"$f":"\"Scale = \"&Results!R110& \"/12\"","v":"Scale = 0/12"}]
[]
[null,{"$f":"Results!F19","v":""}]
[]
[null,{"$f":"Results!Q111","v":"3.4 Y aurait-il des mesures, liées à la conception des prestations, au paiement des prestataires ou à des systèmes sous-jacents non financiers, qui ciblent les problèmes découlant de la fragmentation des caisses ?"}]
[]
[null,{"$f":"\"Scale = \"&Results!R111& \"/12\"","v":"Scale = 0/12"}]
[]
[null,{"$f":"Results!F20","v":""}]
[]
[null,{"$f":"Results!Q112","v":"3.5 Dans quelle mesure les différentes sources de recettes et de financement sont-elles organisées de manière complémentaire, afin de financer un paquet de prestations pour l’ensemble de la population ?"}]
[]
[null,{"$f":"\"Scale = \"&Results!R112& \"/12\"","v":"Scale = 0/12"}]
[]
[null,{"$f":"Results!F21","v":""}]
[]
[null,{"$f":"Results!Q113","v":"3.6 Dans quelle mesure les dispositifs d’assurance-maladie volontaire sont-ils une source d’inégalités, créant des effets de contagion potentiellement néfastes pour l’ensemble du système de santé ?"}]
[]
[null,{"$f":"\"Scale = \"&Results!R113& \"/12\"","v":"Scale = 0/12"}]
[]
[null,{"$f":"Results!F22","v":""}]
[]
[null,{"$f":"Results!Q114","v":"4.10 Dans quelle mesure l’achat et le paiement des produits pharmaceutiques sont-ils mis en œuvre pour promouvoir l’utilisation efficace des médicaments (par ex. le recours aux génériques plutôt qu’aux princeps) et pour améliorer la protection financière des patients ?"}]
[]
[null,{"$f":"\"Scale = \"&Results!R114& \"/12\"","v":"Scale = 0/12"}]
[]
[null,{"$f":"Results!F33","v":""}]
[]
[null,{"$f":"Results!Q115","v":"5.4 Dans quelle mesure les prestations accordent-elles la priorité aux catégories de population prioritaires, par exemple pour une meilleure utilisation des services hautement prioritaires et la protection financière ?"}]
[]
[null,{"$f":"\"Scale = \"&Results!R115& \"/12\"","v":"Scale = 0/12"}]
[]
[null,{"$f":"Results!F37","v":""}]
[]
[null,{"$f":"Results!Q116","v":"5.6 Dans quelle mesure les prestations sont-elles alignées sur le paiement des prestataires, afin de s’assurer qu’elles sont fournies et que les patients bénéficient d’une protection financière ?"}]
[]
[null,{"$f":"\"Scale = \"&Results!R116& \"/12\"","v":"Scale = 0/12"}]
[]
[null,{"$f":"Results!F39","v":""}]
[]
[]
[]
[]
[null,{"$f":"Results!P118","v":"Qualité"}]
[]
[]
[]
[]
[]
[]
[]
[]
[]
[]
[]
[]
[]
[]
[]
[]
[]
[]
[]
[]
[]
[]
[]
[]
[]
[]
[]
[]
[]
[]
[]
[]
[]
[]
[]
[]
[null,{"$f":"Results!Q119","v":"4.2 Dans quelle mesure les paiements des prestataires sont-ils harmonisés entre régimes/sources de recettes et entre secteurs public et privé, afin de garantir des incitations cohérentes aux prestataires ?"}]
[]
[null,{"$f":"\"Scale = \"&Results!R119& \"/12\"","v":"Scale = 0/12"}]
[]
[null,{"$f":"Results!F25","v":""}]
[]
[null,{"$f":"Results!Q120","v":"4.3 Dans quelle mesure les méthodes de paiement des prestataires et les achats en général favorisent-ils la qualité des soins et la coordination des soins entre les spécialités et les différents niveaux de soins ?"}]
[]
[null,{"$f":"\"Scale = \"&Results!R120& \"/12\"","v":"Scale = 0/12"}]
[]
[null,{"$f":"Results!F26","v":""}]
[]
[null,{"$f":"Results!Q121","v":"4.4 Dans quelle mesure les contrats d’achat précisent-ils des exigences en matière de qualité des soins, y compris la disponibilité et la pertinence des soins, puis vérifient-ils de façon régulière qu’elles sont bien respectées ?"}]
[]
[null,{"$f":"\"Scale = \"&Results!R121& \"/12\"","v":"Scale = 0/12"}]
[]
[null,{"$f":"Results!F27","v":""}]
[]
[null,{"$f":"Results!Q122","v":"4.6 Dans quelle mesure les formulaires de demande standard, basés sur les formulaires de consultation avec le patient, sont-ils utilisés indépendamment de l’affiliation du patient au régime et utilisés pour examiner et évaluer les demandes ?"}]
[]
[null,{"$f":"\"Scale = \"&Results!R122& \"/12\"","v":"Scale = 0/12"}]
[]
[null,{"$f":"Results!F29","v":""}]
[]
[null,{"$f":"Results!Q123","v":"4.7 Dans quelle mesure les paiements des prestataires ne couvrent-ils qu’une partie des coûts totaux, ou couvrent-ils les coûts totaux, y compris les salaires, les dépenses récurrentes, etc. "}]
[]
[null,{"$f":"\"Scale = \"&Results!R123& \"/12\"","v":"Scale = 0/12"}]
[]
[null,{"$f":"Results!F30","v":""}]
[]
[null,{"$f":"Results!Q124","v":"4.8 Dans quelle mesure les prestataires jouissent-ils d’une autonomie financière et sont-ils tenus responsables, dans une mesure réaliste et conforme à leurs capacités ?"}]
[]
[null,{"$f":"\"Scale = \"&Results!R124& \"/12\"","v":"Scale = 0/12"}]
[]
[null,{"$f":"Results!F31","v":""}]
[]
[null,{"$f":"Results!Q125","v":"4.9 Dans quelle mesure l’accréditation des prestataires ou les contrats sélectifs sont-ils établis, fonctionnels et utilisés pour les achats ?"}]
[]
[null,{"$f":"\"Scale = \"&Results!R125& \"/12\"","v":"Scale = 0/12"}]
[]
[null,{"$f":"Results!F32","v":""}]
[]
[null,{"$f":"Results!Q126","v":"7.2 Dans quelle mesure les institutions responsables du financement de la santé disposent-elles de capacités adéquates, notamment en matière de ressources humaines (capacités techniques et managériales) et de TIC ?"}]
[]
[null,{"$f":"\"Scale = \"&Results!R126& \"/12\"","v":"Scale = 0/12"}]
[]
[null,{"$f":"Results!F53","v":""}]
[]
[]
[]
[null,{"$f":"Results!P128","v":"Utilisation par rapport aux besoins"}]
[]
[]
[]
[]
[]
[]
[]
[]
[]
[]
[]
[]
[]
[]
[]
[]
[]
[]
[]
[]
[]
[]
[]
[]
[]
[]
[]
[]
[]
[]
[]
[]
[]
[]
[]
[]
[]
[]
[]
[]
[null,{"$f":"Results!Q129","v":"2.3 Dans quelle mesure le financement public de la santé dans votre pays est-il prévisible sur plusieurs années ?"}]
[]
[null,{"$f":"\"Scale = \"&Results!R129& \"/12\"","v":"Scale = 0/12"}]
[]
[null,{"$f":"Results!F14","v":""}]
[]
[null,{"$f":"Results!Q130","v":"2.4 Dans quelle mesure le flux de fonds publics est-il stable, Serait-ce grâce à une exécution régulière, c’est-à-dire un déblocage des fonds dans les délais, conformément aux budgets de santé approuvés ?"}]
[]
[null,{"$f":"\"Scale = \"&Results!R130& \"/12\"","v":"Scale = 0/12"}]
[]
[null,{"$f":"Results!F15","v":""}]
[]
[null,{"$f":"Results!Q131","v":"2.5 Dans quelle mesure les différentes sources de recettes sont-elles obtenues de façon progressive (c.-à-d. en fonction de la capacité de payer), et partant favorisent l’équité dans le mode de financement du système de santé ?"}]
[]
[null,{"$f":"\"Scale = \"&Results!R131& \"/12\"","v":"Scale = 0/12"}]
[]
[null,{"$f":"Results!F16","v":""}]
[]
[null,{"$f":"Results!Q132","v":"3.2 Dans le cadre du processus global d’élaboration et de planification de la mise en œuvre des politiques de financement de la santé, quelle est l’approche de votre pays en matière de dispositifs de mise en commun des recettes ?"}]
[]
[null,{"$f":"\"Scale = \"&Results!R132& \"/12\"","v":"Scale = 0/12"}]
[]
[null,{"$f":"Results!F18","v":""}]
[]
[null,{"$f":"Results!Q133","v":"3.3 Dans quelle mesure la capacité de redistribution des fonds prépayés dans votre pays est-elle limitée par les accords institutionnels de financement de la santé ?"}]
[]
[null,{"$f":"\"Scale = \"&Results!R133& \"/12\"","v":"Scale = 0/12"}]
[]
[null,{"$f":"Results!F19","v":""}]
[]
[null,{"$f":"Results!Q134","v":"3.4 Y aurait-il des mesures, liées à la conception des prestations, au paiement des prestataires ou à des systèmes sous-jacents non financiers, qui ciblent les problèmes découlant de la fragmentation des caisses ?"}]
[]
[null,{"$f":"\"Scale = \"&Results!R134& \"/12\"","v":"Scale = 0/12"}]
[]
[null,{"$f":"Results!F20","v":""}]
[]
[null,{"$f":"Results!Q135","v":"3.5 Dans quelle mesure les différentes sources de recettes et de financement sont-elles organisées de manière complémentaire, afin de financer un paquet de prestations pour l’ensemble de la population ?"}]
[]
[null,{"$f":"\"Scale = \"&Results!R135& \"/12\"","v":"Scale = 0/12"}]
[]
[null,{"$f":"Results!F21","v":""}]
[]
[null,{"$f":"Results!Q136","v":"4.1 Dans quelle mesure les allocations de fonds aux acheteurs de niveau inférieur, par exemple les administrations locales, et/ou les taux de paiement aux prestataires sont-ils le reflet des besoins de santé de la population ?"}]
[]
[null,{"$f":"\"Scale = \"&Results!R136& \"/12\"","v":"Scale = 0/12"}]
[]
[null,{"$f":"Results!F24","v":""}]
[]
[null,{"$f":"Results!Q137","v":"5.3 Dans quelle mesure les droits à prestation reflètent-ils explicitement les besoins de santé de la population ?"}]
[]
[null,{"$f":"\"Scale = \"&Results!R137& \"/12\"","v":"Scale = 0/12"}]
[]
[null,{"$f":"Results!F36","v":""}]
[]
[null,{"$f":"Results!Q138","v":"5.4 Dans quelle mesure les prestations accordent-elles la priorité aux catégories de population prioritaires, par exemple pour une meilleure utilisation des services hautement prioritaires et la protection financière ?"}]
[]
[null,{"$f":"\"Scale = \"&Results!R138& \"/12\"","v":"Scale = 0/12"}]
[]
[null,{"$f":"Results!F37","v":""}]
[]
[null,{"$f":"Results!Q139","v":"5.5 Dans quelle mesure les droits et obligations de la population sont-ils explicitement définis et compris par les intéressés ?"}]
[]
[null,{"$f":"\"Scale = \"&Results!R139& \"/12\"","v":"Scale = 0/12"}]
[]
[null,{"$f":"Results!F38","v":""}]
[]
[null,{"$f":"Results!Q140","v":"5.6 Dans quelle mesure les prestations sont-elles alignées sur le paiement des prestataires, afin de s’assurer qu’elles sont fournies et que les patients bénéficient d’une protection financière ?"}]
[]
[null,{"$f":"\"Scale = \"&Results!R140& \"/12\"","v":"Scale = 0/12"}]
[]
[null,{"$f":"Results!F39","v":""}]
[]
[null,{"$f":"Results!Q141","v":"5.7 Dans quelle mesure les prestations, y compris le partage des coûts pour les patients, sont-elles alignées sur les recettes, afin d’assurer un financement adéquat des droits à prestations approuvés ?"}]
[]
[null,{"$f":"\"Scale = \"&Results!R141& \"/12\"","v":"Scale = 0/12"}]
[]
[null,{"$f":"Results!F40","v":""}]
[]
[null,{"$f":"Results!Q142","v":"6.4 Mesure dans laquelle les allocations budgétaires annuelles en matière de santé sont alignées sur les priorités du secteur de la santé (niveau, structure, nature/objectif)"}]
[]
[null,{"$f":"\"Scale = \"&Results!R142& \"/12\"","v":"Scale = 0/12"}]
[]
[null,{"$f":"Results!F44","v":""}]
[]
[null,{"$f":"Results!Q143","v":"6.6 Dans quelle mesure les transferts fiscaux sont conçus et mis en œuvre de sorte à améliorer l’équité de la distribution des ressources dans le secteur de la santé?"}]
[]
[null,{"$f":"\"Scale = \"&Results!R143& \"/12\"","v":"Scale = 0/12"}]
[]
[null,{"$f":"Results!F46","v":""}]
[]
[null,{"$f":"Results!Q144","v":"6.7 Dans quelle mesure les règles du budget de la santé permettent-elles une certaine souplesse des dépenses? "}]
[]
[null,{"$f":"\"Scale = \"&Results!R144& \"/12\"","v":"Scale = 0/12"}]
[]
[null,{"$f":"Results!F47","v":""}]
[]
[null,{"$f":"Results!Q145","v":"6.11 Dans quelle mesure les flux financiers multiples, la structure budgétaire et les règles de GFP sont alignés sur les politiques d’achats stratégiques?"}]
[]
[null,{"$f":"\"Scale = \"&Results!R145& \"/12\"","v":"Scale = 0/12"}]
[]
[null,{"$f":"Results!F50","v":""}]

{"sheet":"Exc2","index":32,"n_rows":176,"n_cols":29,"rows_kept":176,"cut":false,"hidden":true,"merged":[[60,28,60,30],[21,28,21,30],[27,28,27,30],[28,28,28,30],[40,28,40,30],[41,28,41,30],[44,28,44,30],[57,28,57,30],[58,28,58,30],[59,28,59,30],[33,28,33,30],[32,28,32,30],[34,28,34,30],[35,28,35,30],[36,28,36,30],[22,28,22,30],[37,28,37,30],[38,28,38,30],[47,28,47,30],[48,28,48,30],[49,28,49,30],[53,28,53,30],[54,28,54,30],[55,28,55,30],[19,26,19,27],[20,3,20,15],[2,1,2,30],[4,1,4,30],[6,1,12,30],[15,2,15,15],[15,16,15,17],[15,18,15,19],[15,20,15,21],[15,22,15,23],[15,24,15,25],[15,26,15,27],[15,28,15,30],[18,28,18,30],[19,28,19,30],[16,28,16,30],[17,28,17,30],[20,28,20,30],[19,3,19,15],[19,16,19,17],[19,18,19,19],[19,20,19,21],[19,22,19,23],[19,24,19,25],[16,1,20,1],[16,3,16,15],[16,16,16,17],[16,18,16,19],[16,20,16,21],[16,22,16,23],[16,24,16,25],[17,16,17,17],[17,18,17,19],[17,20,17,21],[17,22,17,23],[17,24,17,25],[16,26,16,27],[17,26,17,27],[18,3,18,15],[18,16,18,17],[18,18,18,19],[18,20,18,21],[18,22,18,23],[18,24,18,25],[18,26,18,27],[17,3,17,15],[21,24,21,25],[21,26,21,27],[22,3,22,15],[20,16,20,17],[20,18,20,19],[20,20,20,21],[20,22,20,23],[20,24,20,25],[20,26,20,27],[22,24,22,25],[22,26,22,27],[21,1,24,1],[21,3,21,15],[21,16,21,17],[21,18,21,19],[21,20,21,21],[21,22,21,23],[24,3,24,15],[24,16,24,17],[24,18,24,19],[24,20,24,21],[23,3,23,15],[23,16,23,17],[23,18,23,19],[23,20,23,21],[23,22,23,23],[22,16,22,17],[22,18,22,19],[22,20,22,21],[22,22,22,23],[29,28,29,30],[32,16,32,17],[32,18,32,19],[32,20,32,21],[23,24,23,25],[23,26,23,27],[23,28,23,30],[24,22,24,23],[24,24,24,25],[24,26,24,27],[24,28,24,30],[30,28,30,30],[25,28,25,30],[26,28,26,30],[31,28,31,30],[28,20,28,21],[28,22,28,23],[28,24,28,25],[28,26,28,27],[29,20,29,21],[29,22,29,23],[29,24,29,25],[29,26,29,27],[25,2,25,15],[25,16,25,17],[25,18,25,19],[25,20,25,21],[25,22,25,23],[25,24,25,25],[25,26,25,27],[30,3,30,15],[30,16,30,17],[30,18,30,19],[30,20,30,21],[30,22,30,23],[30,24,30,25],[30,26,30,27],[27,3,27,15],[27,16,27,17],[27,18,27,19],[27,20,27,21],[27,22,27,23],[27,24,27,25],[27,26,27,27],[29,3,29,15],[29,16,29,17],[29,18,29,19],[28,3,28,15],[28,16,28,17],[28,18,28,19],[34,26,34,27],[33,3,33,15],[33,16,33,17],[33,18,33,19],[33,20,33,21],[33,22,33,23],[33,24,33,25],[34,20,34,21],[34,22,34,23],[34,24,34,25],[32,22,32,23],[32,24,32,25],[31,16,31,17],[31,18,31,19],[26,1,28,1],[26,3,26,15],[26,16,26,17],[26,18,26,19],[26,20,26,21],[26,22,26,23],[29,1,38,1],[31,26,31,27],[33,26,33,27],[32,26,32,27],[31,3,31,15],[26,24,26,25],[26,26,26,27],[31,20,31,21],[31,22,31,23],[31,24,31,25],[32,3,32,15],[36,18,36,19],[36,20,36,21],[36,22,36,23],[36,24,36,25],[34,3,34,15],[34,16,34,17],[34,18,34,19],[36,26,36,27],[35,3,35,15],[35,16,35,17],[35,18,35,19],[35,20,35,21],[35,22,35,23],[35,24,35,25],[35,26,35,27],[38,3,38,15],[38,16,38,17],[38,18,38,19],[38,20,38,21],[38,22,38,23],[38,24,38,25],[38,26,38,27],[37,3,37,15],[37,16,37,17],[37,18,37,19],[37,20,37,21],[37,22,37,23],[37,24,37,25],[37,26,37,27],[36,3,36,15],[36,16,36,17],[39,26,39,27],[39,28,39,30],[40,1,46,1],[40,3,40,15],[40,16,40,17],[40,18,40,19],[40,20,40,21],[40,22,40,23],[40,24,40,25],[40,26,40,27],[39,2,39,15],[39,16,39,17],[39,18,39,19],[39,20,39,21],[39,22,39,23],[39,24,39,25],[41,3,41,15],[41,16,41,17],[41,18,41,19],[41,20,41,21],[41,22,41,23],[41,24,41,25],[41,26,41,27],[42,26,42,27],[43,3,43,15],[43,16,43,17],[43,18,43,19],[43,20,43,21],[43,22,43,23],[43,24,43,25],[43,26,43,27],[43,28,43,30],[42,3,42,15],[42,16,42,17],[42,18,42,19],[42,20,42,21],[42,22,42,23],[42,24,42,25],[42,28,42,30],[44,26,44,27],[45,3,45,15],[45,16,45,17],[45,18,45,19],[45,20,45,21],[45,22,45,23],[45,24,45,25],[45,26,45,27],[45,28,45,30],[44,3,44,15],[44,16,44,17],[44,18,44,19],[44,20,44,21],[44,22,44,23],[44,24,44,25],[46,26,46,27],[46,28,46,30],[47,1,50,1],[47,3,47,15],[47,16,47,17],[47,18,47,19],[47,20,47,21],[47,22,47,23],[47,24,47,25],[47,26,47,27],[46,3,46,15],[46,16,46,17],[46,18,46,19],[46,20,46,21],[46,22,46,23],[46,24,46,25],[48,3,48,15],[48,16,48,17],[48,18,48,19],[48,20,48,21],[48,22,48,23],[48,24,48,25],[48,26,48,27],[49,26,49,27],[50,3,50,15],[50,16,50,17],[50,18,50,19],[50,20,50,21],[50,22,50,23],[50,24,50,25],[50,26,50,27],[50,28,50,30],[49,3,49,15],[49,16,49,17],[49,18,49,19],[49,20,49,21],[49,22,49,23],[49,24,49,25],[51,26,51,27],[51,28,51,30],[52,1,56,1],[52,3,52,15],[52,16,52,17],[52,18,52,19],[52,20,52,21],[52,22,52,23],[52,24,52,25],[52,26,52,27],[51,2,51,15],[51,16,51,17],[51,18,51,19],[51,20,51,21],[51,22,51,23],[51,24,51,25],[52,28,52,30],[53,3,53,15],[53,16,53,17],[53,18,53,19],[53,20,53,21],[53,22,53,23],[53,24,53,25],[53,26,53,27],[54,26,54,27],[55,3,55,15],[55,16,55,17],[55,18,55,19],[55,20,55,21],[55,22,55,23],[55,24,55,25],[55,26,55,27],[54,3,54,15],[54,16,54,17],[54,18,54,19],[54,20,54,21],[54,22,54,23],[54,24,54,25],[56,26,56,27],[56,28,56,30],[57,1,62,1],[57,3,57,15],[57,16,57,17],[57,18,57,19],[57,20,57,21],[57,22,57,23],[57,24,57,25],[57,26,57,27],[56,3,56,15],[56,16,56,17],[56,18,56,19],[56,20,56,21],[56,22,56,23],[56,24,56,25],[58,3,58,15],[58,16,58,17],[58,18,58,19],[58,20,58,21],[58,22,58,23],[58,24,58,25],[58,26,58,27],[59,26,59,27],[60,3,60,15],[60,16,60,17],[60,18,60,19],[60,20,60,21],[60,22,60,23],[60,24,60,25],[60,26,60,27],[59,3,59,15],[59,16,59,17],[59,18,59,19],[59,20,59,21],[59,22,59,23],[59,24,59,25],[74,1,74,13],[74,14,74,26],[74,27,74,29],[66,1,73,29],[61,26,61,27],[62,3,62,15],[62,16,62,17],[62,18,62,19],[62,20,62,21],[62,22,62,23],[62,24,62,25],[62,26,62,27],[61,3,61,15],[61,16,61,17],[61,18,61,19],[61,20,61,21],[61,22,61,23],[61,24,61,25],[61,28,61,30],[62,28,62,30],[172,1,174,1],[175,1,180,1],[184,1,191,1],[86,1,91,1],[93,1,97,1],[98,1,103,1],[107,1,114,1],[127,1,132,1],[134,1,138,1],[139,1,144,1],[148,1,153,1],[165,1,170,1]]}
[]
[]
[null,{"$f":"'Print your results'!C341","v":"MATRICE DE PROGRÈS POUR LE FINANCEMENT DE LA SANTÉ"}]
[]
[null,{"$f":"'Print your results'!C343","v":"OBJECTIFS DU SYSTÈME DE SANTÉ"}]
[]
[null,{"$f":"'Print your results'!C345","v":"La plupart des problèmes abordés dans les questions de la matrice ont une influence sur les performances du système de santé ; par exemple, une utilisation accrue des recettes publiques devrait améliorer la protection financière. L’OMS fait correspondre chaque question aux objectifs et buts des systèmes de santé, et les revoit en permanence. Sur cette page, vous pouvez voir un résumé des résultats que vous avez obtenus par rapport à ces objectifs. Ainsi, par exemple, lorsque votre évaluation reflète une situation bien avancée, ou des progrès considérables, l’effet sur les performances du système de santé est supposé être plus marqué, et ce qui apparaît ci-dessous par une teinte bleue plus sombre."}]
[]
[]
[]
[]
[]
[]
[]
[]
[null,null,{"$f":"'Print your results'!D351","v":"Questions"},null,null,null,null,null,null,null,null,null,null,null,null,null,{"$f":"'Print your results'!R351","v":"Efficience"},null,{"$f":"'Print your results'!T351","v":"Équité dans la distribution des ressources"},null,{"$f":"'Print your results'!V351","v":"Transparence et responsabilité"},null,{"$f":"'Print your results'!X351","v":"Équité des financements"},null,{"$f":"'Print your results'!Z351","v":"Protection financière "},null,{"$f":"'Print your results'!AB351","v":"Qualité"},null,{"$f":"'Print your results'!AD351","v":"Utilisation par rapport aux besoins"}]
[null,{"$f":"'Print your results'!C352","v":"Collecte de recettes"},{"$f":"'Print your results'!D352","v":"Q2.1"},{"$f":"'Print your results'!E352","v":"Quelle approche est en vigueur dans votre pays en matière d’élaboration de politiques et de stratégies de collecte de revenus ? Cette approche s'inscrit-elle dans le cadre du processus global d’élaboration et de planification de la mise en œuvre des politiques de financement de la santé ?"},null,null,null,null,null,null,null,null,null,null,null,null,{"$f":"'Print your results'!R352","v":0},null,{"$f":"'Print your results'!T352","v":0},null,{"$f":"'Print your results'!V352","v":0},null,{"$f":"'Print your results'!X352","v":0},null,{"$f":"'Print your results'!Z352","v":0},null,{"$f":"'Print your results'!AB352","v":0},null,{"$f":"'Print your results'!AD352","v":0}]
[null,null,{"$f":"'Print your results'!D353","v":"Q2.2"},{"$f":"'Print your results'!E353","v":"Dans quelle mesure le financement de la santé dans votre pays repose-t-il sur des sources de financement public/obligatoire (par exemple, fiscalité/recettes publiques, y compris les cotisations obligatoires à l’assurance-maladie nationale/sociale) ?"},null,null,null,null,null,null,null,null,null,null,null,null,{"$f":"'Print your results'!R353","v":0},null,{"$f":"'Print your results'!T353","v":0},null,{"$f":"'Print your results'!V353","v":0},null,{"$f":"'Print your results'!X353","v":0},null,{"$f":"'Print your results'!Z353","v":0},null,{"$f":"'Print your results'!AB353","v":0},null,{"$f":"'Print your results'!AD353","v":0}]
[null,null,{"$f":"'Print your results'!D354","v":"Q2.3"},{"$f":"'Print your results'!E354","v":"Dans quelle mesure le financement public de la santé dans votre pays est-il prédictible sur plusieurs années ?"},null,null,null,null,null,null,null,null,null,null,null,null,{"$f":"'Print your results'!R354","v":0},null,{"$f":"'Print your results'!T354","v":0},null,{"$f":"'Print your results'!V354","v":0},null,{"$f":"'Print your results'!X354","v":0},null,{"$f":"'Print your results'!Z354","v":0},null,{"$f":"'Print your results'!AB354","v":0},null,{"$f":"'Print your results'!AD354","v":0}]
[null,null,{"$f":"'Print your results'!D355","v":"Q2.4"},{"$f":"'Print your results'!E355","v":"Dans quelle mesure le flux de fonds publics est-il stable, notamment grâce à une exécution budgétaire régulière, c’est-à-dire un déblocage des fonds dans les délais, conformément aux budgets de santé approuvés ?"},null,null,null,null,null,null,null,null,null,null,null,null,{"$f":"'Print your results'!R355","v":0},null,{"$f":"'Print your results'!T355","v":0},null,{"$f":"'Print your results'!V355","v":0},null,{"$f":"'Print your results'!X355","v":0},null,{"$f":"'Print your results'!Z355","v":0},null,{"$f":"'Print your results'!AB355","v":0},null,{"$f":"'Print your results'!AD355","v":0}]
[null,null,{"$f":"'Print your results'!D356","v":"Q2.5"},{"$f":"'Print your results'!E356","v":"Dans quelle mesure les différentes sources de revenus sont-elles collectées de façon progressive (c.-à-d. en fonction de la capacité de payer), et partant de là favorisent l’équité dans le mode de financement du système de santé ?"},null,null,null,null,null,null,null,null,null,null,null,null,{"$f":"'Print your results'!R356","v":0},null,{"$f":"'Print your results'!T356","v":0},null,{"$f":"'Print your results'!V356","v":0},null,{"$f":"'Print your results'!X356","v":0},null,{"$f":"'Print your results'!Z356","v":0},null,{"$f":"'Print your results'!AB356","v":0},null,{"$f":"'Print your results'!AD356","v":0}]
[null,{"$f":"'Print your results'!C357","v":"Mise en commun des recettes"},{"$f":"'Print your results'!D357","v":"Q3.1"},{"$f":"'Print your results'!E357","v":"Cette question a été maintenant remplacé par l’étape 1 et le tableau de vue d’ensemble et ne constitue donc plus une question distincte. Merci de bien vous assurer que vous avez complété l’étape 1 car cela vous aidera à remplir les questions de cette section."},null,null,null,null,null,null,null,null,null,null,null,null,{"$f":"'Print your results'!R357","v":0},null,{"$f":"'Print your results'!T357","v":0},null,{"$f":"'Print your results'!V357","v":0},null,{"$f":"'Print your results'!X357","v":0},null,{"$f":"'Print your results'!Z357","v":0},null,{"$f":"'Print your results'!AB357","v":0},null,{"$f":"'Print your results'!AD357","v":0}]
[null,null,{"$f":"'Print your results'!D358","v":"Q3.2"},{"$f":"'Print your results'!E358","v":"Dans le cadre du processus global d’élaboration et de planification de la mise en œuvre des politiques de financement de la santé, quelle est l’approche de votre pays en matière de dispositifs de mise en commun des ressources ?"},null,null,null,null,null,null,null,null,null,null,null,null,{"$f":"'Print your results'!R358","v":0},null,{"$f":"'Print your results'!T358","v":0},null,{"$f":"'Print your results'!V358","v":0},null,{"$f":"'Print your results'!X358","v":0},null,{"$f":"'Print your results'!Z358","v":0},null,{"$f":"'Print your results'!AB358","v":0},null,{"$f":"'Print your results'!AD358","v":0}]
[null,null,{"$f":"'Print your results'!D359","v":"Q3.3"},{"$f":"'Print your results'!E359","v":"Dans quelle mesure la capacité de redistribution des fonds prépayés dans votre pays est-elle limitée par le cadre institutionnel du financement de la santé ?"},null,null,null,null,null,null,null,null,null,null,null,null,{"$f":"'Print your results'!R359","v":0},null,{"$f":"'Print your results'!T359","v":0},null,{"$f":"'Print your results'!V359","v":0},null,{"$f":"'Print your results'!X359","v":0},null,{"$f":"'Print your results'!Z359","v":0},null,{"$f":"'Print your results'!AB359","v":0},null,{"$f":"'Print your results'!AD359","v":0}]
[null,null,{"$f":"'Print your results'!D360","v":"Q3.4"},{"$f":"'Print your results'!E360","v":"Y-a-il des mesures, dans la conception des prestations, le paiement des prestataires ou les systèmes sous-jacents non financiers, qui visent à contrecarrer les problèmes découlant de la fragmentation de l’architecture du financement de la santé ?"},null,null,null,null,null,null,null,null,null,null,null,null,{"$f":"'Print your results'!R360","v":0},null,{"$f":"'Print your results'!T360","v":0},null,{"$f":"'Print your results'!V360","v":0},null,{"$f":"'Print your results'!X360","v":0},null,{"$f":"'Print your results'!Z360","v":0},null,{"$f":"'Print your results'!AB360","v":0},null,{"$f":"'Print your results'!AD360","v":0}]
[null,null,{"$f":"'Print your results'!D361","v":"Questions"},null,null,null,null,null,null,null,null,null,null,null,null,null,{"$f":"'Print your results'!R361","v":"Efficience"},null,{"$f":"'Print your results'!T361","v":"Équité dans la distribution des ressources"},null,{"$f":"'Print your results'!V361","v":"Transparence et responsabilité"},null,{"$f":"'Print your results'!X361","v":"Équité des financements"},null,{"$f":"'Print your results'!Z361","v":"Protection financière "},null,{"$f":"'Print your results'!AB361","v":"Qualité"},null,{"$f":"'Print your results'!AD361","v":"Utilisation par rapport aux besoins"}]
[null,null,{"$f":"'Print your results'!D362","v":"Q3.5"},{"$f":"'Print your results'!E362","v":"Dans quelle mesure les différentes sources de revenus et de financement sont-elles organisées de manière complémentaire, afin de financer un paquet de prestations pour l’ensemble de la population ?"},null,null,null,null,null,null,null,null,null,null,null,null,{"$f":"'Print your results'!R362","v":0},null,{"$f":"'Print your results'!T362","v":0},null,{"$f":"'Print your results'!V362","v":0},null,{"$f":"'Print your results'!X362","v":0},null,{"$f":"'Print your results'!Z362","v":0},null,{"$f":"'Print your results'!AB362","v":0},null,{"$f":"'Print your results'!AD362","v":0}]
[null,null,{"$f":"'Print your results'!D363","v":"Q3.6"},{"$f":"'Print your results'!E363","v":"Dans quelle mesure les dispositifs d’assurance-maladie volontaire sont-ils une source d’inégalités, créant des effets de contagion potentiellement néfastes pour l’ensemble du système de santé ?"},null,null,null,null,null,null,null,null,null,null,null,null,{"$f":"'Print your results'!R363","v":0},null,{"$f":"'Print your results'!T363","v":0},null,{"$f":"'Print your results'!V363","v":0},null,{"$f":"'Print your results'!X363","v":0},null,{"$f":"'Print your results'!Z363","v":0},null,{"$f":"'Print your results'!AB363","v":0},null,{"$f":"'Print your results'!AD363","v":0}]
[null,null,{"$f":"'Print your results'!D364","v":"Q3.7"},{"$f":"'Print your results'!E364","v":"Dans quelle mesure les flux financiers sont-ils incohérents et redondants, et empêchent d’utiliser efficacement le budget public et les fonds des donateurs ?"},null,null,null,null,null,null,null,null,null,null,null,null,{"$f":"'Print your results'!R364","v":0},null,{"$f":"'Print your results'!T364","v":0},null,{"$f":"'Print your results'!V364","v":0},null,{"$f":"'Print your results'!X364","v":0},null,{"$f":"'Print your results'!Z364","v":0},null,{"$f":"'Print your results'!AB364","v":0},null,{"$f":"'Print your results'!AD364","v":0}]
[null,{"$f":"'Print your results'!C365","v":"Achats et paiement des prestataires"},{"$f":"'Print your results'!D365","v":"Q4.1"},{"$f":"'Print your results'!E365","v":"Dans quelle mesure les allocations de fonds aux acheteurs de niveau inférieur, par exemple les administrations locales, et/ou les taux de paiement aux prestataires sont-ils le reflet des besoins de santé de la population ?"},null,null,null,null,null,null,null,null,null,null,null,null,{"$f":"'Print your results'!R365","v":0},null,{"$f":"'Print your results'!T365","v":0},null,{"$f":"'Print your results'!V365","v":0},null,{"$f":"'Print your results'!X365","v":0},null,{"$f":"'Print your results'!Z365","v":0},null,{"$f":"'Print your results'!AB365","v":0},null,{"$f":"'Print your results'!AD365","v":0}]
[null,null,{"$f":"'Print your results'!D366","v":"Q4.2"},{"$f":"'Print your results'!E366","v":"Dans quelle mesure les paiements des prestataires sont-ils harmonisés entre régimes/sources de revenus et entre secteurs public et privé, afin de garantir des incitations cohérentes aux prestataires ?"},null,null,null,null,null,null,null,null,null,null,null,null,{"$f":"'Print your results'!R366","v":0},null,{"$f":"'Print your results'!T366","v":0},null,{"$f":"'Print your results'!V366","v":0},null,{"$f":"'Print your results'!X366","v":0},null,{"$f":"'Print your results'!Z366","v":0},null,{"$f":"'Print your results'!AB366","v":0},null,{"$f":"'Print your results'!AD366","v":0}]
[null,null,{"$f":"'Print your results'!D367","v":"Q4.3"},{"$f":"'Print your results'!E367","v":"Dans quelle mesure les méthodes de paiement des prestataires et les achats en général favorisent-ils la qualité des soins et la coordination des soins entre les spécialités et les différents niveaux de soins ?"},null,null,null,null,null,null,null,null,null,null,null,null,{"$f":"'Print your results'!R367","v":0},null,{"$f":"'Print your results'!T367","v":0},null,{"$f":"'Print your results'!V367","v":0},null,{"$f":"'Print your results'!X367","v":0},null,{"$f":"'Print your results'!Z367","v":0},null,{"$f":"'Print your results'!AB367","v":0},null,{"$f":"'Print your results'!AD367","v":0}]
[null,null,{"$f":"'Print your results'!D368","v":"Q4.4"},{"$f":"'Print your results'!E368","v":"Dans quelle mesure les contrats d’achat précisent-ils des exigences en matière de qualité des soins, y compris la disponibilité et la pertinence des soins, puis vérifient-ils de façon régulière qu’elles sont bien respectées ?"},null,null,null,null,null,null,null,null,null,null,null,null,{"$f":"'Print your results'!R368","v":0},null,{"$f":"'Print your results'!T368","v":0},null,{"$f":"'Print your results'!V368","v":0},null,{"$f":"'Print your results'!X368","v":0},null,{"$f":"'Print your results'!Z368","v":0},null,{"$f":"'Print your results'!AB368","v":0},null,{"$f":"'Print your results'!AD368","v":0}]
[null,null,{"$f":"'Print your results'!D369","v":"Q4.5"},{"$f":"'Print your results'!E369","v":"Dans quelle mesure les méthodes de paiement des prestataires favorisent-elles l’efficacité de l’allocation des ressources, par exemple en réduisant la prestation excessive ou en augmentant celle insuffisante des services, et gèrent-elles la croissance des dépenses ?"},null,null,null,null,null,null,null,null,null,null,null,null,{"$f":"'Print your results'!R369","v":0},null,{"$f":"'Print your results'!T369","v":0},null,{"$f":"'Print your results'!V369","v":0},null,{"$f":"'Print your results'!X369","v":0},null,{"$f":"'Print your results'!Z369","v":0},null,{"$f":"'Print your results'!AB369","v":0},null,{"$f":"'Print your results'!AD369","v":0}]
[null,null,{"$f":"'Print your results'!D370","v":"Q4.6"},{"$f":"'Print your results'!E370","v":"Dans quelle mesure les formulaires de consultation des patients sont-ils normalisés dans l'ensemble du système de santé et utilisés pour analyser et évaluer l'activité de l’ensemble des prestataires et de la population "},null,null,null,null,null,null,null,null,null,null,null,null,{"$f":"'Print your results'!R370","v":0},null,{"$f":"'Print your results'!T370","v":0},null,{"$f":"'Print your results'!V370","v":0},null,{"$f":"'Print your results'!X370","v":0},null,{"$f":"'Print your results'!Z370","v":0},null,{"$f":"'Print your results'!AB370","v":0},null,{"$f":"'Print your results'!AD370","v":0}]
[null,null,{"$f":"'Print your results'!D371","v":"Q4.7"},{"$f":"'Print your results'!E371","v":"Dans quelle mesure les paiements des prestataires  couvrent  uniquement une partie ou l’ensemble des coûts totaux (y compris les salaires, les dépenses récurrentes, etc.) ?"},null,null,null,null,null,null,null,null,null,null,null,null,{"$f":"'Print your results'!R371","v":0},null,{"$f":"'Print your results'!T371","v":0},null,{"$f":"'Print your results'!V371","v":0},null,{"$f":"'Print your results'!X371","v":0},null,{"$f":"'Print your results'!Z371","v":0},null,{"$f":"'Print your results'!AB371","v":0},null,{"$f":"'Print your results'!AD371","v":0}]
[null,null,{"$f":"'Print your results'!D372","v":"Q4.8"},{"$f":"'Print your results'!E372","v":"Dans quelle mesure les prestataires jouissent-ils d’une autonomie financière et sont-ils tenus responsables, dans une mesure réaliste et conforme à leurs capacités ?"},null,null,null,null,null,null,null,null,null,null,null,null,{"$f":"'Print your results'!R372","v":0},null,{"$f":"'Print your results'!T372","v":0},null,{"$f":"'Print your results'!V372","v":0},null,{"$f":"'Print your results'!X372","v":0},null,{"$f":"'Print your results'!Z372","v":0},null,{"$f":"'Print your results'!AB372","v":0},null,{"$f":"'Print your results'!AD372","v":0}]
[null,null,{"$f":"'Print your results'!D373","v":"Q4.9"},{"$f":"'Print your results'!E373","v":"Dans quelle mesure l’accréditation des prestataires ou les contrats sélectifs sont-ils établis, fonctionnels et utilisés pour les achats ?"},null,null,null,null,null,null,null,null,null,null,null,null,{"$f":"'Print your results'!R373","v":0},null,{"$f":"'Print your results'!T373","v":0},null,{"$f":"'Print your results'!V373","v":0},null,{"$f":"'Print your results'!X373","v":0},null,{"$f":"'Print your results'!Z373","v":0},null,{"$f":"'Print your results'!AB373","v":0},null,{"$f":"'Print your results'!AD373","v":0}]
[null,null,{"$f":"'Print your results'!D374","v":"Q4.10"},{"$f":"'Print your results'!E374","v":"Dans quelle mesure l’achat et le paiement des produits pharmaceutiques sont-ils mis en œuvre pour promouvoir l’utilisation efficace des médicaments (par exemple le recours aux génériques plutôt qu’aux princeps) et pour améliorer la protection financière des patients ?"},null,null,null,null,null,null,null,null,null,null,null,null,{"$f":"'Print your results'!R374","v":0},null,{"$f":"'Print your results'!T374","v":0},null,{"$f":"'Print your results'!V374","v":0},null,{"$f":"'Print your results'!X374","v":0},null,{"$f":"'Print your results'!Z374","v":0},null,{"$f":"'Print your results'!AB374","v":0},null,{"$f":"'Print your results'!AD374","v":0}]
[null,null,{"$f":"'Print your results'!D375","v":"Questions"},null,null,null,null,null,null,null,null,null,null,null,null,null,{"$f":"'Print your results'!R375","v":"Efficience"},null,{"$f":"'Print your results'!T375","v":"Équité dans la distribution des ressources"},null,{"$f":"'Print your results'!V375","v":"Transparence et responsabilité"},null,{"$f":"'Print your results'!X375","v":"Équité des financements"},null,{"$f":"'Print your results'!Z375","v":"Protection financière "},null,{"$f":"'Print your results'!AB375","v":"Qualité"},null,{"$f":"'Print your results'!AD375","v":"Utilisation par rapport aux besoins"}]
[null,{"$f":"'Print your results'!C376","v":"Prestations et droits"},{"$f":"'Print your results'!D376","v":"Q5.1"},{"$f":"'Print your results'!E376","v":"Cette question a été maintenant remplacé par l’étape 1 et le tableau de vue d’ensemble et ne constitue donc plus une question distincte. Merci de bien vous assurer que vous avez complété l’étape 1 car cela vous aidera à remplir les questions de cette section."},null,null,null,null,null,null,null,null,null,null,null,null,{"$f":"'Print your results'!R376","v":0},null,{"$f":"'Print your results'!T376","v":0},null,{"$f":"'Print your results'!V376","v":0},null,{"$f":"'Print your results'!X376","v":0},null,{"$f":"'Print your results'!Z376","v":0},null,{"$f":"'Print your results'!AB376","v":0},null,{"$f":"'Print your results'!AD376","v":0}]
[null,null,{"$f":"'Print your results'!D377","v":"Q5.2"},{"$f":"'Print your results'!E377","v":"Dans quelle mesure les décisions et les révisions relatives aux prestations sont-elles prises de manière transparente, sur la base d’un processus clairement défini et de critères convenus, tels que le rapport coût-efficacité, la protection financière, l’impact budgétaire ?"},null,null,null,null,null,null,null,null,null,null,null,null,{"$f":"'Print your results'!R377","v":0},null,{"$f":"'Print your results'!T377","v":0},null,{"$f":"'Print your results'!V377","v":0},null,{"$f":"'Print your results'!X377","v":0},null,{"$f":"'Print your results'!Z377","v":0},null,{"$f":"'Print your results'!AB377","v":0},null,{"$f":"'Print your results'!AD377","v":0}]
[null,null,{"$f":"'Print your results'!D378","v":"Q5.3"},{"$f":"'Print your results'!E378","v":"Dans quelle mesure les droits à prestation reflètent-ils explicitement les besoins de santé de la population ?"},null,null,null,null,null,null,null,null,null,null,null,null,{"$f":"'Print your results'!R378","v":0},null,{"$f":"'Print your results'!T378","v":0},null,{"$f":"'Print your results'!V378","v":0},null,{"$f":"'Print your results'!X378","v":0},null,{"$f":"'Print your results'!Z378","v":0},null,{"$f":"'Print your results'!AB378","v":0},null,{"$f":"'Print your results'!AD378","v":0}]
[null,null,{"$f":"'Print your results'!D379","v":"Q5.4"},{"$f":"'Print your results'!E379","v":"Dans quelle mesure les prestations accordent-elles la priorité aux catégories de population prioritaires, par exemple pour une meilleure utilisation des services hautement prioritaires et pour la protection financière ?"},null,null,null,null,null,null,null,null,null,null,null,null,{"$f":"'Print your results'!R379","v":0},null,{"$f":"'Print your results'!T379","v":0},null,{"$f":"'Print your results'!V379","v":0},null,{"$f":"'Print your results'!X379","v":0},null,{"$f":"'Print your results'!Z379","v":0},null,{"$f":"'Print your results'!AB379","v":0},null,{"$f":"'Print your results'!AD379","v":0}]
[null,null,{"$f":"'Print your results'!D380","v":"Q5.5"},{"$f":"'Print your results'!E380","v":"Dans quelle mesure les droits et obligations de la population sont-ils explicitement définis et compris par les intéressés ?"},null,null,null,null,null,null,null,null,null,null,null,null,{"$f":"'Print your results'!R380","v":0},null,{"$f":"'Print your results'!T380","v":0},null,{"$f":"'Print your results'!V380","v":0},null,{"$f":"'Print your results'!X380","v":0},null,{"$f":"'Print your results'!Z380","v":0},null,{"$f":"'Print your results'!AB380","v":0},null,{"$f":"'Print your results'!AD380","v":0}]
[null,null,{"$f":"'Print your results'!D381","v":"Q5.6"},{"$f":"'Print your results'!E381","v":"Dans quelle mesure les prestations sont-elles alignées sur le paiement des prestataires, afin de s’assurer qu’elles sont fournies et que les patients bénéficient d’une protection financière ?"},null,null,null,null,null,null,null,null,null,null,null,null,{"$f":"'Print your results'!R381","v":0},null,{"$f":"'Print your results'!T381","v":0},null,{"$f":"'Print your results'!V381","v":0},null,{"$f":"'Print your results'!X381","v":0},null,{"$f":"'Print your results'!Z381","v":0},null,{"$f":"'Print your results'!AB381","v":0},null,{"$f":"'Print your results'!AD381","v":0}]
[null,null,{"$f":"'Print your results'!D382","v":"Q5.7"},{"$f":"'Print your results'!E382","v":"Dans quelle mesure les prestations, y compris le partage des coûts pour les patients, sont-elles alignées sur les recettes, afin d’assurer un financement adéquat des droits à prestations approuvés ?"},null,null,null,null,null,null,null,null,null,null,null,null,{"$f":"'Print your results'!R382","v":0},null,{"$f":"'Print your results'!T382","v":0},null,{"$f":"'Print your results'!V382","v":0},null,{"$f":"'Print your results'!X382","v":0},null,{"$f":"'Print your results'!Z382","v":0},null,{"$f":"'Print your results'!AB382","v":0},null,{"$f":"'Print your results'!AD382","v":0}]
[null,{"$f":"'Print your results'!C383","v":"Gestion des finances publiques (GFP)"},{"$f":"'Print your results'!D383","v":"Q6.1"},{"$f":"'Print your results'!E383","v":"Est-ce qu’un diagnostic/une évaluation approfondi(e) des goulets d’étranglement de la GFP dans le secteur de la santé a été effectué(e) récemment, par exemple au cours des trois dernières années ?"},null,null,null,null,null,null,null,null,null,null,null,null,{"$f":"'Print your results'!R383","v":0},null,{"$f":"'Print your results'!T383","v":0},null,{"$f":"'Print your results'!V383","v":0},null,{"$f":"'Print your results'!X383","v":0},null,{"$f":"'Print your results'!Z383","v":0},null,{"$f":"'Print your results'!AB383","v":0},null,{"$f":"'Print your results'!AD383","v":0}]
[null,null,{"$f":"'Print your results'!D384","v":"Q6.2"},{"$f":"'Print your results'!E384","v":"Le personnel du Ministère de la santé dispose-t-il de capacités à comprendre les (nouvelles) règles de GFP et à les appliquer au processus budgétaire du secteur de la santé ?"},null,null,null,null,null,null,null,null,null,null,null,null,{"$f":"'Print your results'!R384","v":0},null,{"$f":"'Print your results'!T384","v":0},null,{"$f":"'Print your results'!V384","v":0},null,{"$f":"'Print your results'!X384","v":0},null,{"$f":"'Print your results'!Z384","v":0},null,{"$f":"'Print your results'!AB384","v":0},null,{"$f":"'Print your results'!AD384","v":0}]
[null,null,{"$f":"'Print your results'!D387","v":"Q6.5"},{"$f":"'Print your results'!E387","v":"Dans quelle mesure le processus budgétaire est consultatif, transparent et un processus d’examen et d’ajustement budgétaire à mi-parcours est établi ?"},null,null,null,null,null,null,null,null,null,null,null,null,{"$f":"'Print your results'!R387","v":0},null,{"$f":"'Print your results'!T387","v":0},null,{"$f":"'Print your results'!V387","v":0},null,{"$f":"'Print your results'!X387","v":0},null,{"$f":"'Print your results'!Z387","v":0},null,{"$f":"'Print your results'!AB387","v":0},null,{"$f":"'Print your results'!AD387","v":0}]
[null,null,{"$f":"'Print your results'!D388","v":"Q6.6"},{"$f":"'Print your results'!E388","v":"Dans quelle mesure les transferts fiscaux sont conçus et mis en œuvre de sorte à améliorer l’équité de la distribution des ressources dans le secteur de la santé?"},null,null,null,null,null,null,null,null,null,null,null,null,{"$f":"'Print your results'!R388","v":0},null,{"$f":"'Print your results'!T388","v":0},null,{"$f":"'Print your results'!V388","v":0},null,{"$f":"'Print your results'!X388","v":0},null,{"$f":"'Print your results'!Z388","v":0},null,{"$f":"'Print your results'!AB388","v":0},null,{"$f":"'Print your results'!AD388","v":0}]
[null,null,{"$f":"'Print your results'!D389","v":"Questions"},null,null,null,null,null,null,null,null,null,null,null,null,null,{"$f":"'Print your results'!R389","v":"Efficience"},null,{"$f":"'Print your results'!T389","v":"Équité dans la distribution des ressources"},null,{"$f":"'Print your results'!V389","v":"Transparence et responsabilité"},null,{"$f":"'Print your results'!X389","v":"Équité des financements"},null,{"$f":"'Print your results'!Z389","v":"Protection financière "},null,{"$f":"'Print your results'!AB389","v":"Qualité"},null,{"$f":"'Print your results'!AD389","v":"Utilisation par rapport aux besoins"}]
[null,{"$f":"'Print your results'!C390","v":"Gestion des finances publiques (GFP)"},{"$f":"'Print your results'!D390","v":"Q6.7"},{"$f":"'Print your results'!E390","v":"Dans quelle mesure les règles du budget de la santé permettent-elles une certaine souplesse des dépenses? "},null,null,null,null,null,null,null,null,null,null,null,null,{"$f":"'Print your results'!R390","v":0},null,{"$f":"'Print your results'!T390","v":0},null,{"$f":"'Print your results'!V390","v":0},null,{"$f":"'Print your results'!X390","v":0},null,{"$f":"'Print your results'!Z390","v":0},null,{"$f":"'Print your results'!AB390","v":0},null,{"$f":"'Print your results'!AD390","v":0}]
[null,null,{"$f":"'Print your results'!D391","v":"Q6.8"},{"$f":"'Print your results'!E391","v":"La flexibilité dans l’utilisation des ressources est-elle assurée ou déléguée au bon niveau?"},null,null,null,null,null,null,null,null,null,null,null,null,{"$f":"'Print your results'!R391","v":0},null,{"$f":"'Print your results'!T391","v":0},null,{"$f":"'Print your results'!V391","v":0},null,{"$f":"'Print your results'!X391","v":0},null,{"$f":"'Print your results'!Z391","v":0},null,{"$f":"'Print your results'!AB391","v":0},null,{"$f":"'Print your results'!AD391","v":0}]
[null,null,{"$f":"'Print your results'!D392","v":"Q6.9"},{"$f":"'Print your results'!E392","v":"Dans quelle mesure des politiques de discipline budgétaire visant à contrôler les dépenses sont en vigueur (par exemple, gestion de la trésorerie, respect des règles d’approvisionnement) et mises en œuvre efficacement?"},null,null,null,null,null,null,null,null,null,null,null,null,{"$f":"'Print your results'!R392","v":0},null,{"$f":"'Print your results'!T392","v":0},null,{"$f":"'Print your results'!V392","v":0},null,{"$f":"'Print your results'!X392","v":0},null,{"$f":"'Print your results'!Z392","v":0},null,{"$f":"'Print your results'!AB392","v":0},null,{"$f":"'Print your results'!AD392","v":0}]
[null,null,{"$f":"'Print your results'!D393","v":"Q6.10"},{"$f":"'Print your results'!E393","v":"Dans quelle mesure des systèmes d’information sont en place pour répondre aux besoins en matière de responsabilité financière et pour assurer le suivi des performances du secteur de la santé?"},null,null,null,null,null,null,null,null,null,null,null,null,{"$f":"'Print your results'!R393","v":0},null,{"$f":"'Print your results'!T393","v":0},null,{"$f":"'Print your results'!V393","v":0},null,{"$f":"'Print your results'!X393","v":0},null,{"$f":"'Print your results'!Z393","v":0},null,{"$f":"'Print your results'!AB393","v":0},null,{"$f":"'Print your results'!AD393","v":0}]
[null,null,{"$f":"'Print your results'!D394","v":"Q6.11"},{"$f":"'Print your results'!E394","v":"Dans quelle mesure les flux financiers multiples, la structure budgétaire et les règles de GFP sont alignés sur les politiques d’achats stratégiques?"},null,null,null,null,null,null,null,null,null,null,null,null,{"$f":"'Print your results'!R394","v":0},null,{"$f":"'Print your results'!T394","v":0},null,{"$f":"'Print your results'!V394","v":0},null,{"$f":"'Print your results'!X394","v":0},null,{"$f":"'Print your results'!Z394","v":0},null,{"$f":"'Print your results'!AB394","v":0},null,{"$f":"'Print your results'!AD394","v":0}]
[null,{"$f":"'Print your results'!C395","v":"Gouvernance"},{"$f":"'Print your results'!D395","v":"Q7.1"},{"$f":"'Print your results'!E395","v":"Dans quelle mesure les rôles et les responsabilités (liés aux objectifs de financement de la santé et au rendement en matière de collecte de recettes, de mise en commun, d’achats, de prestations, etc.) sont clairement définis et répartis entre les institutions responsables du financement de la santé ?"},null,null,null,null,null,null,null,null,null,null,null,null,{"$f":"'Print your results'!R395","v":0},null,{"$f":"'Print your results'!T395","v":0},null,{"$f":"'Print your results'!V395","v":0},null,{"$f":"'Print your results'!X395","v":0},null,{"$f":"'Print your results'!Z395","v":0},null,{"$f":"'Print your results'!AB395","v":0},null,{"$f":"'Print your results'!AD395","v":0}]
[null,null,{"$f":"'Print your results'!D396","v":"Q7.2"},{"$f":"'Print your results'!E396","v":"Dans quelle mesure les institutions responsables du financement de la santé disposent-elles de capacités adéquates, notamment en matière de ressources humaines (capacités techniques et managériales) et de TIC ?"},null,null,null,null,null,null,null,null,null,null,null,null,{"$f":"'Print your results'!R396","v":0},null,{"$f":"'Print your results'!T396","v":0},null,{"$f":"'Print your results'!V396","v":0},null,{"$f":"'Print your results'!X396","v":0},null,{"$f":"'Print your results'!Z396","v":0},null,{"$f":"'Print your results'!AB396","v":0},null,{"$f":"'Print your results'!AD396","v":0}]
[null,null,{"$f":"'Print your results'!D397","v":"Q7.3"},{"$f":"'Print your results'!E397","v":"Dans quelle mesure les mécanismes de responsabilisation des organismes d’achat/de financement (y compris l’autonomie et le conseil d’administration de l’agence d’assurance-maladie, les mécanismes de récompense/sanction, etc.) sont-ils en place pour s’assurer que la politique de financement de la santé appuie les progrès vers les objectifs du secteur et que les fonds sont utilisés efficacement pour les populations, programmes et services prioritaires ?"},null,null,null,null,null,null,null,null,null,null,null,null,{"$f":"'Print your results'!R397","v":0},null,{"$f":"'Print your results'!T397","v":0},null,{"$f":"'Print your results'!V397","v":0},null,{"$f":"'Print your results'!X397","v":0},null,{"$f":"'Print your results'!Z397","v":0},null,{"$f":"'Print your results'!AB397","v":0},null,{"$f":"'Print your results'!AD397","v":0}]
[null,null,{"$f":"'Print your results'!D398","v":"Q7.4"},{"$f":"'Print your results'!E398","v":"L’utilisation des fonds ou les performances des institutions achetant des services auprès des prestataires de services de santé ou le budget de la santé ont-ils été communiqués au public (par exemple sous forme de rapport annuel) ?"},null,null,null,null,null,null,null,null,null,null,null,null,{"$f":"'Print your results'!R398","v":0},null,{"$f":"'Print your results'!T398","v":0},null,{"$f":"'Print your results'!V398","v":0},null,{"$f":"'Print your results'!X398","v":0},null,{"$f":"'Print your results'!Z398","v":0},null,{"$f":"'Print your results'!AB398","v":0},null,{"$f":"'Print your results'!AD398","v":0}]
[null,null,{"$f":"'Print your results'!D399","v":"Q7.5"},{"$f":"'Print your results'!E399","v":"Dans quelle mesure le Ministère des finances, le Ministère de la santé et l’organisme national d’assurance-maladie participent au processus d’élaboration des politiques de financement de la santé et en sont informés ?"},null,null,null,null,null,null,null,null,null,null,null,null,{"$f":"'Print your results'!R399","v":0},null,{"$f":"'Print your results'!T399","v":0},null,{"$f":"'Print your results'!V399","v":0},null,{"$f":"'Print your results'!X399","v":0},null,{"$f":"'Print your results'!Z399","v":0},null,{"$f":"'Print your results'!AB399","v":0},null,{"$f":"'Print your results'!AD399","v":0}]
[null,null,{"$f":"'Print your results'!D400","v":"Q7.6"},{"$f":"'Print your results'!E400","v":"Dans quelle mesure le processus d’élaboration des politiques de financement de la santé est transparent et participatif?"},null,null,null,null,null,null,null,null,null,null,null,null,{"$f":"'Print your results'!R400","v":0},null,{"$f":"'Print your results'!T400","v":0},null,{"$f":"'Print your results'!V400","v":0},null,{"$f":"'Print your results'!X400","v":0},null,{"$f":"'Print your results'!Z400","v":0},null,{"$f":"'Print your results'!AB400","v":0},null,{"$f":"'Print your results'!AD400","v":0}]
[]
[]
[]
[null,"WHO hopes that you found the matrices useful in your discussions. We are very interested to receive feedback on how the matrices can be improved. Please email your assessment to WHO at healthfinancing@who.int. Your assessment will be treated confidentially, and will not be shared with a third party without your consent."]
[]
[]
[]
[]
[]
[]
[]
[]
[]
[]
[]
[]
[]
[]
[]
[]
[]
[]
[]
[null,{"$f":"IF(criteria1=0,\"\",Results!D63)","v":""}]
[]
[]
[]
[]
[]
[]
[null,{"$f":"'Print your results'!C438","v":0}]
[]
[]
[]
[]
[null,{"$f":"'Print your results'!C443","v":0}]
[]
[]
[]
[]
[]
[]
[]
[]
[]
[]
[]
[]
[]
[]
[]
[]
[]
[]
[]
[]
[]
[]
[]
[]
[]
[]
[]
[]
[null,{"$f":"IF(criteria1=0,\"\",Results!E63)","v":""}]
[]
[]
[]
[]
[]
[]
[null,{"$f":"'Print your results'!C479","v":0}]
[]
[]
[]
[]
[null,{"$f":"'Print your results'!C484","v":0}]
[]
[]
[]
[]
[]
[]
[]
[]
[]
[]
[]
[]
[]
[]
[]
[]
[]
[]
[]
[]
[]
[]
[]
[]
[]
[null,{"$f":"IF(criteria1=0,\"\",Results!E103)","v":""}]
[]
[]
[]
[]
[]
[]
[null,{"$f":"'Print your results'!C519","v":0}]
[]
[]
[null,{"$f":"'Print your results'!C524","v":0}]

{"sheet":"Exc3","index":33,"n_rows":235,"n_cols":2,"rows_kept":235,"cut":false,"hidden":true,"merged":[]}
[]
[]
[]
[]
[null,"OVERVIEW OF HEALTH COVERAGE SCHEMES IN YOUR COUNTRY"]
[]
[]
[null,{"$f":"Results!B63","v":"HEALTH INSURANCE SCHEME\n(add specific name in your country)"}]
[]
[null,{"$f":"Results!A63","v":"CRITERIA"}]
[]
[null,{"$f":"Results!A64","v":"POPULATION CIBLE\nTous les citoyens sont-ils couverts ou un sous-groupe spécifique, par exemple moins de 5 ans, salariés?\n"}]
[]
[null,{"$f":"Results!B64","v":""}]
[]
[null,{"$f":"Results!A65","v":"POPULATION COUVERTE / souscrite\nNombre réel relatif à la pop cible.\n"}]
[]
[null,{"$f":"Results!B65","v":""}]
[]
[null,{"$f":"Results!A66","v":"BASE DE COUVERTURE / SOUSCRIPTION\nPar exemple. obligatoire, automatique, volontaire\n"}]
[]
[null,{"$f":"Results!B66","v":""}]
[]
[null,{"$f":"Results!A67","v":"AVANTAGES / DROITS\nUne liste de services ou niveau de soins est-elle définie? Est-ce que les utilisateurs doivent faire des co-paiements?\n"}]
[]
[null,{"$f":"Results!B67","v":""}]
[]
[null,{"$f":"Results!A68","v":"SOURCES DE REVENUS\nD'où vient l'argent? Allocations / transferts budgétaires; contributions prépayées.\n"}]
[]
[null,{"$f":"Results!B68","v":""}]
[]
[null,{"$f":"Results!A69","v":"ACCORDS DE MISE EN COMMUN\nLe budget de la santé est-il alloué aux autorités régionales, existe-t-il un ou plusieurs fonds d '«assurance»?\n"}]
[]
[null,{"$f":"Results!B69","v":""}]
[]
[null,{"$f":"Results!A70","v":"MODALITES D'ACHAT\nDécrivez les arrangements de gestion et de gouvernance?\n"}]
[]
[null,{"$f":"Results!B70","v":""}]
[]
[null,{"$f":"Results!A71","v":"PAIEMENT DU FOURNISSEUR\nPar exemple. les entrées par ligne ou poste budgétaire; Ticket de soins/Service, paiement au cas par cas, capitation, basé sur performances?\n"}]
[]
[null,{"$f":"Results!B71","v":""}]
[]
[null,{"$f":"Results!A72","v":"PRESTATION DE SERVICES & CONTRACTUALISATION\nDe quels fournisseurs les services sont-ils achetés? Public-privé? Des contrats / accords de services sont-ils utilisés?\n"}]
[]
[null,{"$f":"Results!B72","v":""}]
[]
[null,{"$f":"IF(criteria1=0,\"\",Results!C63)","v":""}]
[]
[null,{"$f":"IF(criteria1=0,\"\",B12)","v":""}]
[]
[null,{"$f":"IF(criteria1=0,\"\",Results!C64)","v":""}]
[]
[null,{"$f":"IF(criteria1=0,\"\",Results!A65)","v":""}]
[]
[null,{"$f":"IF(criteria1=0,\"\",Results!C65)","v":""}]
[]
[null,{"$f":"IF(criteria1=0,\"\",Results!A66)","v":""}]
[]
[null,{"$f":"IF(criteria1=0,\"\",Results!C66)","v":""}]
[]
[null,{"$f":"IF(criteria1=0,\"\",Results!A67)","v":""}]
[]
[null,{"$f":"IF(criteria1=0,\"\",Results!C67)","v":""}]
[]
[null,{"$f":"IF(criteria1=0,\"\",Results!A68)","v":""}]
[]
[null,{"$f":"IF(criteria1=0,\"\",Results!C68)","v":""}]
[]
[null,{"$f":"IF(criteria1=0,\"\",Results!A69)","v":""}]
[]
[null,{"$f":"IF(criteria1=0,\"\",Results!C69)","v":""}]
[]
[null,{"$f":"IF(criteria1=0,\"\",Results!A70)","v":""}]
[]
[null,{"$f":"IF(criteria1=0,\"\",Results!C70)","v":""}]
[]
[null,{"$f":"IF(criteria1=0,\"\",Results!A71)","v":""}]
[]
[null,{"$f":"IF(criteria1=0,\"\",Results!C71)","v":""}]
[]
[null,{"$f":"IF(criteria1=0,\"\",Results!A72)","v":""}]
[]
[null,{"$f":"IF(criteria1=0,\"\",Results!C72)","v":""}]
[]
[]
[null,{"$f":"IF(criteria2=0,\"\",Results!D63)","v":""}]
[]
[null,{"$f":"IF(criteria2=0,\"\",Results!A64)","v":""}]
[]
[null,{"$f":"IF(criteria2=0,\"\",Results!D64)","v":""}]
[]
[null,{"$f":"IF(criteria2=0,\"\",Results!A65)","v":""}]
[]
[null,{"$f":"IF(criteria2=0,\"\",Results!D65)","v":""}]
[]
[null,{"$f":"IF(criteria2=0,\"\",Results!A66)","v":""}]
[]
[null,{"$f":"IF(criteria2=0,\"\",Results!D66)","v":""}]
[]
[null,{"$f":"IF(criteria2=0,\"\",Results!A67)","v":""}]
[]
[null,{"$f":"IF(criteria2=0,\"\",Results!D67)","v":""}]
[]
[null,{"$f":"IF(criteria2=0,\"\",Results!A68)","v":""}]
[]
[null,{"$f":"IF(criteria2=0,\"\",Results!D68)","v":""}]
[]
[null,{"$f":"IF(criteria2=0,\"\",Results!A69)","v":""}]
[]
[null,{"$f":"IF(criteria2=0,\"\",Results!D69)","v":""}]
[]
[null,{"$f":"IF(criteria2=0,\"\",Results!A70)","v":""}]
[]
[null,{"$f":"IF(criteria2=0,\"\",Results!D70)","v":""}]
[]
[null,{"$f":"IF(criteria2=0,\"\",Results!A71)","v":""}]
[]
[null,{"$f":"IF(criteria2=0,\"\",Results!D71)","v":""}]
[]
[null,{"$f":"IF(criteria2=0,\"\",Results!A72)","v":""}]
[]
[null,{"$f":"IF(criteria2=0,\"\",Results!D72)","v":""}]
[]
[]
[null,{"$f":"IF(criteria3=0,\"\",Results!E63)","v":""}]
[]
[null,{"$f":"IF(criteria3=0,\"\",$B$12)","v":""}]
[]
[null,{"$f":"IF(criteria3=0,\"\",Results!E64)","v":""}]
[]
[null,{"$f":"IF(criteria3=0,\"\",Results!A65)","v":""}]
[]
[null,{"$f":"IF(criteria3=0,\"\",Results!E65)","v":""}]
[]
[null,{"$f":"IF(criteria3=0,\"\",Results!A66)","v":""}]
[]
[null,{"$f":"IF(criteria3=0,\"\",Results!E66)","v":""}]
[]
[null,{"$f":"IF(criteria3=0,\"\",Results!A67)","v":""}]
[]
[null,{"$f":"IF(criteria3=0,\"\",Results!E67)","v":""}]
[]
[null,{"$f":"IF(criteria3=0,\"\",Results!A68)","v":""}]
[]
[null,{"$f":"IF(criteria3=0,\"\",Results!E68)","v":""}]
[]
[null,{"$f":"IF(criteria3=0,\"\",Results!A69)","v":""}]
[]
[null,{"$f":"IF(criteria3=0,\"\",Results!E69)","v":""}]
[]
[null,{"$f":"IF(criteria3=0,\"\",Results!E70)","v":""}]
[]
[null,{"$f":"IF(criteria3=0,\"\",Results!A71)","v":""}]
[]
[null,{"$f":"IF(criteria3=0,\"\",Results!E71)","v":""}]
[]
[null,{"$f":"IF(criteria3=0,\"\",Results!A72)","v":""}]
[]
[null,{"$f":"IF(criteria3=0,\"\",Results!E72)","v":""}]
[]
[null,{"$f":"IF(criteria4=0,\"\",Results!F63)","v":""}]
[]
[null,{"$f":"IF(criteria4=0,\"\",$B$12)","v":""}]
[]
[null,{"$f":"IF(criteria4=0,\"\",Results!F64)","v":""}]
[]
[null,{"$f":"IF(criteria4=0,\"\",Results!A65)","v":""}]
[]
[null,{"$f":"IF(criteria4=0,\"\",Results!F65)","v":""}]
[]
[null,{"$f":"IF(criteria4=0,\"\",Results!A66)","v":""}]
[]
[null,{"$f":"IF(criteria4=0,\"\",Results!F66)","v":""}]
[]
[null,{"$f":"IF(criteria4=0,\"\",Results!A67)","v":""}]
[]
[null,{"$f":"IF(criteria4=0,\"\",Results!F67)","v":""}]
[]
[null,{"$f":"IF(criteria4=0,\"\",Results!A68)","v":""}]
[]
[null,{"$f":"IF(criteria4=0,\"\",Results!F68)","v":""}]
[]
[null,{"$f":"IF(criteria4=0,\"\",Results!A69)","v":""}]
[]
[null,{"$f":"IF(criteria4=0,\"\",Results!F69)","v":""}]
[]
[null,{"$f":"IF(criteria4=0,\"\",Results!A70)","v":""}]
[]
[null,{"$f":"IF(criteria4=0,\"\",Results!F70)","v":""}]
[]
[null,{"$f":"IF(criteria4=0,\"\",Results!A71)","v":""}]
[]
[null,{"$f":"IF(criteria4=0,\"\",Results!F71)","v":""}]
[]
[null,{"$f":"IF(criteria4=0,\"\",Results!A72)","v":""}]
[]
[null,{"$f":"IF(criteria4=0,\"\",Results!F72)","v":""}]
[]
[]
[null,{"$f":"IF(criteria5=0,\"\",Results!G63)","v":""}]
[]
[null,{"$f":"IF(criteria5=0,\"\",$B$12)","v":""}]
[]
[null,{"$f":"IF(criteria5=0,\"\",Results!G64)","v":""}]
[]
[null,{"$f":"IF(criteria5=0,\"\",Results!A65)","v":""}]
[]
[null,{"$f":"IF(criteria5=0,\"\",Results!G65)","v":""}]
[]
[null,{"$f":"IF(criteria5=0,\"\",Results!A66)","v":""}]
[]
[null,{"$f":"IF(criteria5=0,\"\",Results!G66)","v":""}]
[]
[null,{"$f":"IF(criteria5=0,\"\",Results!A67)","v":""}]
[]
[null,{"$f":"IF(criteria5=0,\"\",Results!G67)","v":""}]
[]
[null,{"$f":"IF(criteria5=0,\"\",Results!A68)","v":""}]
[]
[null,{"$f":"IF(criteria5=0,\"\",Results!G68)","v":""}]
[]
[null,{"$f":"IF(criteria5=0,\"\",Results!A69)","v":""}]
[]
[null,{"$f":"IF(criteria5=0,\"\",Results!G69)","v":""}]
[]
[null,{"$f":"IF(criteria5=0,\"\",Results!A70)","v":""}]
[]
[null,{"$f":"IF(criteria5=0,\"\",Results!G70)","v":""}]
[]
[null,{"$f":"IF(criteria5=0,\"\",Results!A71)","v":""}]
[]
[null,{"$f":"IF(criteria5=0,\"\",Results!G71)","v":""}]
[]
[null,{"$f":"IF(criteria5=0,\"\",Results!A72)","v":""}]

{"sheet":"Utilization","index":34,"n_rows":284,"n_cols":23,"rows_kept":284,"cut":false,"hidden":true,"merged":[[267,22,268,23],[283,22,284,23],[185,22,186,23],[201,22,202,23],[217,22,218,23],[235,22,236,23],[251,22,252,23],[101,22,102,23],[117,22,118,23],[135,22,136,23],[153,22,154,23],[169,22,170,23],[19,22,20,23],[35,22,36,23],[51,22,52,23],[69,22,70,23],[85,22,86,23],[7,3,20,4],[7,6,10,21],[14,6,18,8],[14,10,18,12],[14,14,18,15],[14,17,18,19],[39,3,52,4],[39,6,42,21],[46,10,50,12],[46,14,50,16],[23,3,36,4],[23,6,26,21],[30,6,34,8],[30,10,34,12],[30,14,34,15],[30,17,34,19],[57,3,70,4],[57,6,60,21],[64,6,68,8],[64,10,68,12],[64,14,68,15],[64,17,68,19],[73,3,86,4],[73,6,76,21],[80,6,84,8],[80,10,84,12],[80,14,84,15],[80,17,84,19],[89,3,102,4],[89,6,92,21],[96,6,100,8],[96,10,100,12],[96,14,100,15],[96,17,100,19],[123,3,136,4],[123,6,126,21],[105,3,118,4],[105,6,108,21],[112,6,116,8],[112,10,116,12],[112,14,116,15],[112,17,116,19],[189,3,202,4],[189,6,192,21],[205,3,218,4],[205,6,208,21],[141,3,154,4],[141,6,144,21],[157,3,170,4],[157,6,160,21],[173,3,186,4],[173,6,176,21],[223,3,236,4],[223,6,226,21],[239,3,252,4],[239,6,242,21],[246,6,250,9],[246,10,250,13],[246,14,250,16],[246,17,250,19],[271,3,284,4],[271,6,274,21],[278,17,282,19],[255,3,268,4],[255,6,258,21]]}
[]
[]
[]
[]
[null,null,null,"Utilisation par rapport aux besoins",null,null,null,null,null,null,null," "]
[]
[null,null,null,null,null,null,"Quelle est la situation actuelle dans votre pays en ce qui concerne Q2.3?"]
[null,null,null,"Q2.3 Dans quelle mesure le financement public de la santé dans votre pays est-il prédictible sur plusieurs années ?\n",null,null,"Veuillez indiquer dans cette zone de texte vos idées, réflexions, évolutions récentes, projets actuels, etc.",null,null,null,null,null,null,null,null,null,null,null,null,null,null,null,1]
[]
[]
[]
[]
[]
[]
[]
[]
[]
[]
[]
[null,null,null,null,null,null,null,null,null,null,null,null,null,null,null,null,null,null,null,null,null,null,{"$f":"Results!H14","v":"0/12"}]
[]
[]
[null,null,null,null,null,null,"Quelle est la situation actuelle dans votre pays en ce qui concerne Q2.4?"]
[null,null,null,"Q2.4 Dans quelle mesure le flux de fonds publics est-il stable, notamment grâce à une exécution budgétaire régulière, c’est-à-dire un déblocage des fonds dans les délais, conformément aux budgets de santé approuvés ?\n",null,null,"Veuillez indiquer dans cette zone de texte vos idées, réflexions, évolutions récentes, projets actuels, etc.",null,null,null,null,null,null,null,null,null,null,null,null,null,null,null,1]
[]
[]
[]
[]
[]
[]
[]
[]
[]
[]
[]
[null,null,null,null,null,null,null,null,null,null,null,null,null,null,null,null,null,null,null,null,null,null,{"$f":"Results!H15","v":"0/12"}]
[]
[]
[null,null,null,null,null,null,"Quelle est la situation actuelle dans votre pays en ce qui concerne Q2.5?"]
[null,null,null,"Q2.5 Dans quelle mesure les différentes sources de revenus sont-elles collectées de façon progressive (c.-à-d. en fonction de la capacité de payer), et partant de là favorisent l’équité dans le mode de financement du système de santé ?\n",null,null,"Veuillez indiquer dans cette zone de texte vos idées, réflexions, évolutions récentes, projets actuels, etc.",null,null,null,null,null,null,null,null,null,null,null,null,null,null,null,1]
[]
[]
[]
[]
[]
[]
[]
[]
[]
[]
[]
[null,null,null,null,null,null,null,null,null,null,null,null,null,null,null,null,null,null,null,null,null,null,{"$f":"Results!H16","v":"0/12"}]
[]
[]
[]
[]
[null,null,null,null,null,null,"Quelle est la situation actuelle dans votre pays en ce qui concerne Q3.2?"]
[null,null,null,"Q3.2 Dans le cadre du processus global d’élaboration et de planification de la mise en œuvre des politiques de financement de la santé, quelle est l’approche de votre pays en matière de dispositifs de mise en commun des ressources ?",null,null,"Veuillez indiquer dans cette zone de texte vos idées, réflexions, évolutions récentes, projets actuels, etc.",null,null,null,null,null,null,null,null,null,null,null,null,null,null,null,1]
[]
[]
[]
[]
[]
[]
[]
[]
[]
[]
[]
[null,null,null,null,null,null,null,null,null,null,null,null,null,null,null,null,null,null,null,null,null,null,{"$f":"Results!H18","v":"0/12"}]
[]
[]
[null,null,null,null,null,null,"Quelle est la situation actuelle dans votre pays en ce qui concerne Q3.3?"]
[null,null,null,"Q3.3 Dans quelle mesure la capacité de redistribution des fonds prépayés dans votre pays est-elle limitée par le cadre institutionnel du financement de la santé ?",null,null,"Veuillez indiquer dans cette zone de texte vos idées, réflexions, évolutions récentes, projets actuels, etc.",null,null,null,null,null,null,null,null,null,null,null,null,null,null,null,1]
[]
[]
[]
[]
[]
[]
[]
[]
[]
[]
[]
[null,null,null,null,null,null,null,null,null,null,null,null,null,null,null,null,null,null,null,null,null,null,{"$f":"Results!H19","v":"0/12"}]
[]
[]
[null,null,null,null,null,null,"Quelle est la situation actuelle dans votre pays en ce qui concerne Q3.4?"]
[null,null,null,"Q3.4  Y-a-il des mesures, dans la conception des prestations, le paiement des prestataires ou les systèmes sous-jacents non financiers, qui visent à contrecarrer les problèmes découlant de la fragmentation de l’architecture du financement de la santé ?\n",null,null,"Veuillez indiquer dans cette zone de texte vos idées, réflexions, évolutions récentes, projets actuels, etc.",null,null,null,null,null,null,null,null,null,null,null,null,null,null,null,1]
[]
[]
[]
[]
[]
[]
[]
[]
[]
[]
[]
[null,null,null,null,null,null,null,null,null,null,null,null,null,null,null,null,null,null,null,null,null,null,{"$f":"Results!H20","v":"0/12"}]
[]
[]
[null,null,null,null,null,null,"Quelle est la situation actuelle dans votre pays en ce qui concerne Q3.5?"]
[null,null,null,"Q3.5 Dans quelle mesure les différentes sources de recettes et de financement sont-elles organisées de manière complémentaire, afin de financer un paquet de prestations pour l’ensemble de la population ?\n",null,null,"Veuillez indiquer dans cette zone de texte vos idées, réflexions, évolutions récentes, projets actuels, etc.",null,null,null,null,null,null,null,null,null,null,null,null,null,null,null,1]
[]
[]
[]
[]
[]
[]
[]
[]
[]
[]
[]
[null,null,null,null,null,null,null,null,null,null,null,null,null,null,null,null,null,null,null,null,null,null,{"$f":"Results!H21","v":"0/12"}]
[]
[]
[]
[]
[null,null,null,null,null,null,"Quelle est la situation actuelle dans votre pays en ce qui concerne Q4.1?"]
[null,null,null,"Q4.1 Dans quelle mesure les allocations de fonds aux acheteurs de niveau inférieur, par exemple les administrations locales, et/ou les taux de paiement aux prestataires sont-ils le reflet des besoins de santé de la population ?\n",null,null,"Veuillez indiquer dans cette zone de texte vos idées, réflexions, évolutions récentes, projets actuels, etc.",null,null,null,null,null,null,null,null,null,null,null,null,null,null,null,1]
[]
[]
[]
[]
[]
[]
[]
[]
[]
[]
[]
[null,null,null,null,null,null,null,null,null,null,null,null,null,null,null,null,null,null,null,null,null,null,{"$f":"Results!H24","v":"0/12"}]
[]
[]
[]
[]
[null,null,null,null,null,null,"Quelle est la situation actuelle dans votre pays en ce qui concerne Q5.3?"]
[null,null,null,"Q5.3 Dans quelle mesure les droits à prestation reflètent-ils explicitement les besoins de santé de la population ?\n",null,null,"Veuillez indiquer dans cette zone de texte vos idées, réflexions, évolutions récentes, projets actuels, etc.",null,null,null,null,null,null,null,null,null,null,null,null,null,null,null,1]
[]
[]
[]
[]
[]
[]
[]
[]
[]
[]
[]
[null,null,null,null,null,null,null,null,null,null,null,null,null,null,null,null,null,null,null,null,null,null,{"$f":"Results!H36","v":"0/12"}]
[]
[]
[null,null,null,null,null,null,"Quelle est la situation actuelle dans votre pays en ce qui concerne Q5.4?"]
[null,null,null,"Q5.4 Dans quelle mesure les prestations accordent-elles la priorité aux catégories de population prioritaires, par exemple pour une meilleure utilisation des services hautement prioritaires et pour la protection financière ?\n",null,null,"Veuillez indiquer dans cette zone de texte vos idées, réflexions, évolutions récentes, projets actuels, etc.",null,null,null,null,null,null,null,null,null,null,null,null,null,null,null,1]
[]
[]
[]
[]
[]
[]
[]
[]
[]
[]
[]
[null,null,null,null,null,null,null,null,null,null,null,null,null,null,null,null,null,null,null,null,null,null,{"$f":"Results!H37","v":"0/12"}]
[]
[]
[null,null,null,null,null,null,"Quelle est la situation actuelle dans votre pays en ce qui concerne Q5.5?"]
[null,null,null,"Q5.5 Dans quelle mesure les droits et obligations de la population sont-ils explicitement définis et compris par les intéressés ?\n",null,null,"Veuillez indiquer dans cette zone de texte vos idées, réflexions, évolutions récentes, projets actuels, etc.",null,null,null,null,null,null,null,null,null,null,null,null,null,null,null,1]
[]
[]
[]
[]
[]
[]
[]
[]
[]
[]
[]
[null,null,null,null,null,null,null,null,null,null,null,null,null,null,null,null,null,null,null,null,null,null,{"$f":"Results!H38","v":"0/12"}]
[]
[]
[null,null,null,null,null,null,"Quelle est la situation actuelle dans votre pays en ce qui concerne Q5.6?"]
[null,null,null,"Q5.6 Dans quelle mesure les prestations sont-elles alignées sur le paiement des prestataires, afin de s’assurer qu’elles sont fournies et que les patients bénéficient d’une protection financière ?\n",null,null,"Veuillez indiquer dans cette zone de texte vos idées, réflexions, évolutions récentes, projets actuels, etc.",null,null,null,null,null,null,null,null,null,null,null,null,null,null,null,1]
[]
[]
[]
[]
[]
[]
[]
[]
[]
[]
[]
[null,null,null,null,null,null,null,null,null,null,null,null,null,null,null,null,null,null,null,null,null,null,{"$f":"Results!H39","v":"0/12"}]
[]
[]
[null,null,null,null,null,null,"Quelle est la situation actuelle dans votre pays en ce qui concerne Q5.7?"]
[null,null,null,"Q5.7 Dans quelle mesure les prestations, y compris le partage des coûts pour les patients, sont-elles alignées sur les recettes, afin d’assurer un financement adéquat des droits à prestations approuvés ?\n",null,null,"Veuillez indiquer dans cette zone de texte vos idées, réflexions, évolutions récentes, projets actuels, etc.",null,null,null,null,null,null,null,null,null,null,null,null,null,null,null,1]
[]
[]
[]
[]
[]
[]
[]
[]
[]
[]
[]
[null,null,null,null,null,null,null,null,null,null,null,null,null,null,null,null,null,null,null,null,null,null,{"$f":"Results!H40","v":"0/12"}]
[]
[]
[]
[]
[null,null,null,null,null,null,"Quelle est la situation actuelle dans votre pays en ce qui concerne Q6.4?"]
[null,null,null,"Q6.4 Dans quelle mesure les allocations budgétaires annuelles en matière de santé sont alignées sur les priorités du secteur de la santé (niveau, structure, nature/objectif) ?",null,null,"Veuillez indiquer dans cette zone de texte vos idées, réflexions, évolutions récentes, projets actuels, etc.",null,null,null,null,null,null,null,null,null,null,null,null,null,null,null,1]
[]
[]
[]
[]
[]
[]
[]
[]
[]
[]
[]
[null,null,null,null,null,null,null,null,null,null,null,null,null,null,null,null,null,null,null,null,null,null,{"$f":"Results!H44","v":"0/12"}]
[]
[]
[null,null,null,null,null,null,"Quelle est la situation actuelle dans votre pays en ce qui concerne Q6.6?"]
[null,null,null,"Q6.6 Dans quelle mesure les transferts fiscaux sont conçus et mis en œuvre de sorte à améliorer l’équité de la distribution des ressources dans le secteur de la santé?",null,null,"Veuillez indiquer dans cette zone de texte vos idées, réflexions, évolutions récentes, projets actuels, etc.",null,null,null,null,null,null,null,null,null,null,null,null,null,null,null,1]
[]
[]
[]
[]
[]
[]
[]
[]
[]
[]
[]
[null,null,null,null,null,null,null,null,null,null,null,null,null,null,null,null,null,null,null,null,null,null,{"$f":"Results!H46","v":"0/12"}]
[]
[]
[null,null,null,null,null,null,"Quelle est la situation actuelle dans votre pays en ce qui concerne Q6.7?"]
[null,null,null,"Q6.7 Dans quelle mesure les règles du budget de la santé permettent-elles une certaine souplesse des dépenses? ",null,null,"Veuillez indiquer dans cette zone de texte vos idées, réflexions, évolutions récentes, projets actuels, etc.",null,null,null,null,null,null,null,null,null,null,null,null,null,null,null,1]
[]
[]
[]
[]
[]
[]
[]
[]
[]
[]
[]
[null,null,null,null,null,null,null,null,null,null,null,null,null,null,null,null,null,null,null,null,null,null,{"$f":"Results!H47","v":"0/12"}]
[]
[]
[null,null,null,null,null,null,"Quelle est la situation actuelle dans votre pays en ce qui concerne Q6.11?"]
[null,null,null,"Q6.11 Dans quelle mesure les flux financiers multiples, la structure budgétaire et les règles de GFP sont alignés sur les politiques d’achats stratégiques?",null,null,"Veuillez indiquer dans cette zone de texte vos idées, réflexions, évolutions récentes, projets actuels, etc.",null,null,null,null,null,null,null,null,null,null,null,null,null,null,null,1]
[null,null,null,null,null," "]
[]
[]
[]
[]
[]
[]
[]
[]
[]
[]
[null,null,null,null,null,null,null,null,null,null,null,null,null,null,null,null,null,null,null,null,null,null,{"$f":"Results!H51","v":"0/12"}]

{"sheet":"Objectives","index":35,"n_rows":60,"n_cols":17,"rows_kept":60,"cut":false,"hidden":true,"merged":[[2,5,2,14],[5,3,7,16],[10,3,13,3],[3,3,3,16],[54,3,59,3],[14,3,18,3],[19,3,25,3],[26,3,35,3],[36,3,42,3],[43,3,53,3]]}
[1]
[]
[null,null,null,null,null,"MATRICE DE PROGRÈS POUR LE FINANCEMENT DE LA SANTÉ"]
[null,null,null,"OBJECTIFS DU SYSTÈME DE SANTÉ"]
[]
[null,null,null,"La plupart des problèmes abordés dans les questions de la matrice ont une influence sur les performances du système de santé ; par exemple, une utilisation accrue des recettes publiques devrait améliorer la protection financière. L’OMS fait correspondre chaque question aux objectifs et buts des systèmes de santé, et les revoit en permanence. Sur cette page, vous pouvez voir un résumé des résultats que vous avez obtenus par rapport à ces objectifs. Ainsi, par exemple, lorsque votre évaluation reflète une situation bien avancée, ou des progrès considérables, l’effet sur les performances du système de santé est supposé être plus marqué, et ce qui apparaît ci-dessous par une teinte bleue plus sombre."]
[]
[]
[]
[null,null,null,null,null,"Questions","Reflects whether sophisticated assessment of current performance has been made that ideally identifies the causes of poor performance","Reflects whether an up-to-date policy is formulated based on evidence and participation","Reflects the existence and quality of monitoring system","Reflects the extent and relevance of evaluation mechanisms in the development of health financing policies / reforms","Efficience","Équité dans la distribution des ressources","Transparence et responsabilité","Équité des financements","Protection financière ","Qualité","Utilisation par rapport aux besoins"]
[null,null,null,"Policy Development Process","Q1.1","Has an in-depth diagnosis or assessment of your health financing system been conducted recently which examines the impact on health system performance along with the causes of performance problems?",null,"Reflects whether sophisticated assessment of current performance has been made that ideally identifies the causes of poor performance"]
[null,null,null,null,"Q1.2","Is there an up-to-date policy statement related to health financing, which has been converted into relevant legal documents/government orders?",null,null,"Reflects whether an up-to-date policy is formulated based on evidence and participation"]
[null,null,null,null,"Q1.3","Does a system exist to routinely monitor health financing, and are data used to track progress (e.g. on expenditure patterns and financial protection) and to strengthen public accountability?",null,null,null,"Reflects the existence and quality of monitoring system"]
[null,null,null,null,"Q1.4","Are evaluation studies undertaken on a systematic basis to assess the implementation of specific health financing reforms and their consequences for policy objectives, and are findings used to inform the design & revision of health financing policies?",null,null,null,null,"Reflects the extent and relevance of evaluation mechanisms in the development of health financing policies / reforms"]
[null,null,null,{"$f":"Results!K9","v":"Collecte de recettes"},"Q2.1",{"$f":"Results!D12","v":"Quelle approche est en vigueur dans votre pays en matière d’élaboration de politiques et de stratégies de collecte de revenus ? Cette approche s'inscrit-elle dans le cadre du processus global d’élaboration et de planification de la mise en œuvre des politiques de financement de la santé ?"},null,null,null,null,null,null,{"$f":"Q2.1","v":0},{"$f":"Q2.1","v":0},{"$f":"Q2.1","v":0}]
[null,null,null,null,"Q2.2",{"$f":"Results!D13","v":"Dans quelle mesure le financement de la santé dans votre pays repose-t-il sur des sources de financement public/obligatoire (par exemple, fiscalité/recettes publiques, y compris les cotisations obligatoires à l’assurance-maladie nationale/sociale) ?"},null,null,null,null,null,null,null,{"$f":"Q2.2","v":0},{"$f":"Q2.2","v":0}]
[null,null,null,null,"Q2.3",{"$f":"Results!D14","v":"Dans quelle mesure le financement public de la santé dans votre pays est-il prédictible sur plusieurs années ?"},null,null,null,null,null,null,{"$f":"Q2.3","v":0},null,null,null,{"$f":"Q2.3","v":0}]
[null,null,null,null,"Q2.4",{"$f":"Results!D15","v":"Dans quelle mesure le flux de fonds publics est-il stable, notamment grâce à une exécution budgétaire régulière, c’est-à-dire un déblocage des fonds dans les délais, conformément aux budgets de santé approuvés ?"},null,null,null,null,{"$f":"Q2.4","v":0},null,null,{"$f":"Q2.4","v":0},{"$f":"Q2.4","v":0},null,{"$f":"Q2.4","v":0}]
[null,null,null,null,"Q2.5",{"$f":"Results!D16","v":"Dans quelle mesure les différentes sources de revenus sont-elles collectées de façon progressive (c.-à-d. en fonction de la capacité de payer), et partant de là favorisent l’équité dans le mode de financement du système de santé ?"},null,null,null,null,null,null,null,{"$f":"Q2.5","v":0},{"$f":"Q2.5","v":0},null,{"$f":"Q2.5","v":0}]
[null,null,null,{"$f":"Results!K10","v":"Mise en commun des recettes"},"Q3.1",{"$f":"Results!D17","v":"Cette question a été maintenant remplacé par l’étape 1 et le tableau de vue d’ensemble et ne constitue donc plus une question distincte. Merci de bien vous assurer que vous avez complété l’étape 1 car cela vous aidera à remplir les questions de cette section."}]
[null,null,null,null,"Q3.2",{"$f":"Results!D18","v":"Dans le cadre du processus global d’élaboration et de planification de la mise en œuvre des politiques de financement de la santé, quelle est l’approche de votre pays en matière de dispositifs de mise en commun des ressources ?"},null,null,null,null,{"$f":"Q3.2","v":0},{"$f":"Q3.2","v":0},null,null,{"$f":"Q3.2","v":0},null,{"$f":"Q3.2","v":0}]
[null,null,null,null,"Q3.3",{"$f":"Results!D19","v":"Dans quelle mesure la capacité de redistribution des fonds prépayés dans votre pays est-elle limitée par le cadre institutionnel du financement de la santé ?"},null,null,null,null,{"$f":"Q3.3","v":0},{"$f":"Q3.3","v":0},null,null,{"$f":"Q3.3","v":0},null,{"$f":"Q3.3","v":0}]
[null,null,null,null,"Q3.4",{"$f":"Results!D20","v":"Y-a-il des mesures, dans la conception des prestations, le paiement des prestataires ou les systèmes sous-jacents non financiers, qui visent à contrecarrer les problèmes découlant de la fragmentation de l’architecture du financement de la santé ?"},null,null,null,null,{"$f":"Q3.4","v":0},{"$f":"Q3.4","v":0},null,{"$f":"Q3.4","v":0},{"$f":"Q3.4","v":0},null,{"$f":"Q3.4","v":0}]
[null,null,null,null,"Q3.5",{"$f":"Results!D21","v":"Dans quelle mesure les différentes sources de revenus et de financement sont-elles organisées de manière complémentaire, afin de financer un paquet de prestations pour l’ensemble de la population ?"},null,null,null,null,{"$f":"Q3.5","v":0},{"$f":"Q3.5","v":0},null,null,{"$f":"Q3.5","v":0},null,{"$f":"Q3.5","v":0}]
[null,null,null,null,"Q3.6",{"$f":"Results!D22","v":"Dans quelle mesure les dispositifs d’assurance-maladie volontaire sont-ils une source d’inégalités, créant des effets de contagion potentiellement néfastes pour l’ensemble du système de santé ?"},null,null,null,null,null,{"$f":"Q3.6","v":0},null,{"$f":"Q3.6","v":0},{"$f":"Q3.6","v":0}]
[null,null,null,null,"Q3.7",{"$f":"Results!D23","v":"Dans quelle mesure les flux financiers sont-ils incohérents et redondants, et empêchent d’utiliser efficacement le budget public et les fonds des donateurs ?"},null,null,null,null,{"$f":"Q3.7","v":0}]
[null,null,null,{"$f":"Results!K11","v":"Achats et paiement des prestataires"},"Q4.1",{"$f":"Results!D24","v":"Dans quelle mesure les allocations de fonds aux acheteurs de niveau inférieur, par exemple les administrations locales, et/ou les taux de paiement aux prestataires sont-ils le reflet des besoins de santé de la population ?"},null,null,null,null,null,{"$f":"Q4.1","v":0},null,null,null,null,{"$f":"Q4.1","v":0}]
[null,null,null,null,"Q4.2",{"$f":"Results!D25","v":"Dans quelle mesure les paiements des prestataires sont-ils harmonisés entre régimes/sources de revenus et entre secteurs public et privé, afin de garantir des incitations cohérentes aux prestataires ?"},null,null,null,null,null,{"$f":"Q4.2","v":0},null,null,null,{"$f":"Q4.2","v":0}]
[null,null,null,null,"Q4.3",{"$f":"Results!D26","v":"Dans quelle mesure les méthodes de paiement des prestataires et les achats en général favorisent-ils la qualité des soins et la coordination des soins entre les spécialités et les différents niveaux de soins ?"},null,null,null,null,null,null,null,null,null,{"$f":"Q4.3","v":0}]
[null,null,null,null,"Q4.4",{"$f":"Results!D27","v":"Dans quelle mesure les contrats d’achat précisent-ils des exigences en matière de qualité des soins, y compris la disponibilité et la pertinence des soins, puis vérifient-ils de façon régulière qu’elles sont bien respectées ?"},null,null,null,null,null,null,{"$f":"Q4.4","v":0},null,null,{"$f":"Q4.4","v":0}]
[null,null,null,null,"Q4.5",{"$f":"Results!D28","v":"Dans quelle mesure les méthodes de paiement des prestataires favorisent-elles l’efficacité de l’allocation des ressources, par exemple en réduisant la prestation excessive ou en augmentant celle insuffisante des services, et gèrent-elles la croissance des dépenses ?"},null,null,null,null,{"$f":"Q4.5","v":0}]
[null,null,null,null,"Q4.6",{"$f":"Results!D29","v":"Dans quelle mesure les formulaires de consultation des patients sont-ils normalisés dans l'ensemble du système de santé et utilisés pour analyser et évaluer l'activité de l’ensemble des prestataires et de la population "},null,null,null,null,null,null,null,null,null,{"$f":"Q4.6","v":0}]
[null,null,null,null,"Q4.7",{"$f":"Results!D30","v":"Dans quelle mesure les paiements des prestataires  couvrent  uniquement une partie ou l’ensemble des coûts totaux (y compris les salaires, les dépenses récurrentes, etc.) ?"},null,null,null,null,null,null,null,null,null,{"$f":"Q4.7","v":0}]
[null,null,null,null,"Q4.8",{"$f":"Results!D31","v":"Dans quelle mesure les prestataires jouissent-ils d’une autonomie financière et sont-ils tenus responsables, dans une mesure réaliste et conforme à leurs capacités ?"},null,null,null,null,{"$f":"Q4.8","v":0},null,{"$f":"Q4.8","v":0},null,null,{"$f":"Q4.8","v":0}]
[null,null,null,null,"Q4.9",{"$f":"Results!D32","v":"Dans quelle mesure l’accréditation des prestataires ou les contrats sélectifs sont-ils établis, fonctionnels et utilisés pour les achats ?"},null,null,null,null,{"$f":"Q4.9","v":0},null,null,null,null,{"$f":"Q4.9","v":0}]
[null,null,null,null,"Q4.10",{"$f":"Results!D33","v":"Dans quelle mesure l’achat et le paiement des produits pharmaceutiques sont-ils mis en œuvre pour promouvoir l’utilisation efficace des médicaments (par exemple le recours aux génériques plutôt qu’aux princeps) et pour améliorer la protection financière des patients ?"},null,null,null,null,{"$f":"Q4.10","v":0},null,null,{"$f":"Q4.10","v":0},{"$f":"Q4.10","v":0}]
[null,null,null,{"$f":"Results!K12","v":"Prestations et droits"},"Q5.1",{"$f":"Results!D34","v":"Cette question a été maintenant remplacé par l’étape 1 et le tableau de vue d’ensemble et ne constitue donc plus une question distincte. Merci de bien vous assurer que vous avez complété l’étape 1 car cela vous aidera à remplir les questions de cette section."}]
[null,null,null,null,"Q5.2",{"$f":"Results!D35","v":"Dans quelle mesure les décisions et les révisions relatives aux prestations sont-elles prises de manière transparente, sur la base d’un processus clairement défini et de critères convenus, tels que le rapport coût-efficacité, la protection financière, l’impact budgétaire ?"},null,null,null,null,null,null,{"$f":"Q5.2","v":0}]
[null,null,null,null,"Q5.3",{"$f":"Results!D36","v":"Dans quelle mesure les droits à prestation reflètent-ils explicitement les besoins de santé de la population ?"},null,null,null,null,null,null,null,null,null,null,{"$f":"Q5.3","v":0}]
[null,null,null,null,"Q5.4",{"$f":"Results!D37","v":"Dans quelle mesure les prestations accordent-elles la priorité aux catégories de population prioritaires, par exemple pour une meilleure utilisation des services hautement prioritaires et pour la protection financière ?"},null,null,null,null,null,null,null,{"$f":"Q5.4","v":0},{"$f":"Q5.4","v":0},null,{"$f":"Q5.4","v":0}]
[null,null,null,null,"Q5.5",{"$f":"Results!D38","v":"Dans quelle mesure les droits et obligations de la population sont-ils explicitement définis et compris par les intéressés ?"},null,null,null,null,null,null,{"$f":"Q5.5","v":0}]
[null,null,null,null,"Q5.6",{"$f":"Results!D39","v":"Dans quelle mesure les prestations sont-elles alignées sur le paiement des prestataires, afin de s’assurer qu’elles sont fournies et que les patients bénéficient d’une protection financière ?"},null,null,null,null,null,null,null,{"$f":"Q5.6","v":0},{"$f":"Q5.6","v":0},null,{"$f":"Q5.6","v":0}]
[null,null,null,null,"Q5.7",{"$f":"Results!D40","v":"Dans quelle mesure les prestations, y compris le partage des coûts pour les patients, sont-elles alignées sur les recettes, afin d’assurer un financement adéquat des droits à prestations approuvés ?"},null,null,null,null,null,null,{"$f":"Q5.7","v":0},null,null,null,{"$f":"Q5.7","v":0}]
[null,null,null,{"$f":"Results!K13","v":"Gestion des finances publiques (GFP)"},"Q6.1",{"$f":"Results!D41","v":"Est-ce qu’un diagnostic/une évaluation approfondi(e) des goulets d’étranglement de la GFP dans le secteur de la santé a été effectué(e) récemment, par exemple au cours des trois dernières années ?"}]
[null,null,null,null,"Q6.2",{"$f":"Results!D42","v":"Le personnel du Ministère de la santé dispose-t-il de capacités à comprendre les (nouvelles) règles de GFP et à les appliquer au processus budgétaire du secteur de la santé ?"}]
[null,null,null,null,"Q6.3",{"$f":"Results!D43","v":"Existe-il un processus budgétaire pluriannuel mis en œuvre efficacement ?"}]
[null,null,null,null,"Q6.4",{"$f":"Results!D44","v":"Dans quelle mesure les allocations budgétaires annuelles en matière de santé sont alignées sur les priorités du secteur de la santé (niveau, structure, nature/objectif) ?"},null,null,null,null,null,{"$f":"Q6.4","v":0},null,null,null,null,{"$f":"Q6.4","v":0}]
[null,null,null,null,"Q6.5",{"$f":"Results!D45","v":"Dans quelle mesure le processus budgétaire est consultatif, transparent et un processus d’examen et d’ajustement budgétaire à mi-parcours est établi ?"},null,null,null,null,null,null,{"$f":"Q6.5","v":0}]
[null,null,null,null,"Q6.6",{"$f":"Results!D46","v":"Dans quelle mesure les transferts fiscaux sont conçus et mis en œuvre de sorte à améliorer l’équité de la distribution des ressources dans le secteur de la santé?"},null,null,null,null,null,{"$f":"Q6.6","v":0},null,null,null,null,{"$f":"Q6.6","v":0}]
[null,null,null,null,"Q6.7",{"$f":"Results!D47","v":"Dans quelle mesure les règles du budget de la santé permettent-elles une certaine souplesse des dépenses? "},null,null,null,null,{"$f":"Q6.7","v":0},null,{"$f":"Q6.7","v":0},null,null,null,{"$f":"Q6.7","v":0}]
[null,null,null,null,"Q6.8",{"$f":"Results!D48","v":"La flexibilité dans l’utilisation des ressources est-elle assurée ou déléguée au bon niveau?"},null,null,null,null,{"$f":"Q6.8","v":0}]
[null,null,null,null,"Q6.9",{"$f":"Results!D49","v":"Dans quelle mesure des politiques de discipline budgétaire visant à contrôler les dépenses sont en vigueur (par exemple, gestion de la trésorerie, respect des règles d’approvisionnement) et mises en œuvre efficacement?"},null,null,null,null,{"$f":"Q6.9","v":0},null,{"$f":"Q6.9","v":0}]
[null,null,null,null,"Q6.10",{"$f":"Results!D50","v":"Dans quelle mesure des systèmes d’information sont en place pour répondre aux besoins en matière de responsabilité financière et pour assurer le suivi des performances du secteur de la santé?"}]
[null,null,null,null,"Q6.11",{"$f":"Results!D51","v":"Dans quelle mesure les flux financiers multiples, la structure budgétaire et les règles de GFP sont alignés sur les politiques d’achats stratégiques?"},null,null,null,null,{"$f":"Q6.11","v":0},{"$f":"Q6.11","v":0},null,null,null,null,{"$f":"Q6.11","v":0}]
[null,null,null,{"$f":"Results!K14","v":"Gouvernance"},"Q7.1",{"$f":"Results!D52","v":"Dans quelle mesure les rôles et les responsabilités (liés aux objectifs de financement de la santé et au rendement en matière de collecte de recettes, de mise en commun, d’achats, de prestations, etc.) sont clairement définis et répartis entre les institutions responsables du financement de la santé ?"},null,null,null,null,null,null,{"$f":"Q7.1","v":0}]
[null,null,null,null,"Q7.2",{"$f":"Results!D53","v":"Dans quelle mesure les institutions responsables du financement de la santé disposent-elles de capacités adéquates, notamment en matière de ressources humaines (capacités techniques et managériales) et de TIC ?"},null,null,null,null,null,null,{"$f":"Q7.2","v":0},null,null,{"$f":"Q7.2","v":0}]
[null,null,null,null,"Q7.3",{"$f":"Results!D54","v":"Dans quelle mesure les mécanismes de responsabilisation des organismes d’achat/de financement (y compris l’autonomie et le conseil d’administration de l’agence d’assurance-maladie, les mécanismes de récompense/sanction, etc.) sont-ils en place pour s’assurer que la politique de financement de la santé appuie les progrès vers les objectifs du secteur et que les fonds sont utilisés efficacement pour les populations, programmes et services prioritaires ?"},null,null,null,null,null,null,{"$f":"Q7.3","v":0}]
[null,null,null,null,"Q7.4",{"$f":"Results!D55","v":"L’utilisation des fonds ou les performances des institutions achetant des services auprès des prestataires de services de santé ou le budget de la santé ont-ils été communiqués au public (par exemple sous forme de rapport annuel) ?"},null,null,null,null,null,null,{"$f":"Q7.4","v":0}]
[null,null,null,null,"Q7.5",{"$f":"Results!D56","v":"Dans quelle mesure le Ministère des finances, le Ministère de la santé et l’organisme national d’assurance-maladie participent au processus d’élaboration des politiques de financement de la santé et en sont informés ?"},null,null,null,null,null,null,{"$f":"Q7.5","v":0}]
[null,null,null,null,"Q7.6",{"$f":"Results!D57","v":"Dans quelle mesure le processus d’élaboration des politiques de financement de la santé est transparent et participatif?"},null,null,null,null,null,null,{"$f":"Q7.6","v":0}]